ID,"Collection / Source","Catalog Number","Specify Number",Taxon,"Common Name",State,County,Date,Time,Locale,Latitude,Longitude,Collector,"Life Stage","Collection Method","Preparation Type",Count,Temperature,Humidity,"Dew Point",Wind,"Wind Direction","Barometric Pressure",Sky,"Moon Phase",Notes
36260,,2014-036634,SPM024199,"Erythroneura vitis",None,Iowa,Linn,2011-10-05,,"Wickiup Hill Outdoor Learning Area",42.08398,-91.7651,"Jim Durbin",adult,Blacklight/Fluorescent,Photograph,1,,,,,,,,,
36265,,2014-036639,SPM024214,"Erythroneura vitis",None,Iowa,Linn,2011-10-05,,"Wickiup Hill Outdoor Learning Area",42.08398,-91.7651,"Jim Durbin",adult,Blacklight/Fluorescent,Photograph,1,,,,,,,,,
36296,,2014-036670,SPM030212,"Erythroneura vitis",None,Iowa,Linn,2012-07-08,,"Wanatee County Park",42.0094,-91.56623,"Jim Durbin",adult,Blacklight/Fluorescent,Photograph,1,,,,,,,,,
36318,,2014-036692,SPM031051,"Erythroneura vitis",None,Iowa,Linn,2012-07-27,,"Wanatee County Park",42.0094,-91.56623,"Jim Durbin",adult,Blacklight/Fluorescent,Photograph,1,,,,,,,,,
147215,,2016-011842,,"Erythroneura vitis",None,Iowa,Winneshiek,2011-08-23,,"100 Acre Wood-x",0,0,"MJ Hatfield",adult,,Photograph,1,,,,,,,,,
171192,,2016-035937,,"Erythroneura vitis",None,Iowa,Linn,2016-06-27,2100-2330,"Hitaga Sand Ridge Prairie Preserve",42.250957,-91.632098,"Jim Durbin",adult,Blacklight/Fluorescent,Photograph,1,77,59,62,4,300,30.06,"partly cloudy","50% visible",
172168,,2016-036913,,"Erythroneura vitis",None,Iowa,Linn,2016-07-20,2100-2330,"Hitaga Sand Ridge Prairie Preserve",42.250957,-91.632098,"Jim Durbin",adult,Blacklight/Fluorescent,Photograph,1,81,90,77,5,180,30.01,cloudy,full,
172306,,2016-037051,,"Erythroneura vitis",None,Iowa,Linn,2016-07-20,2100-2330,"Hitaga Sand Ridge Prairie Preserve",42.250957,-91.632098,"Jim Durbin",adult,Blacklight/Fluorescent,Photograph,1,81,90,77,5,180,30.01,cloudy,full,
193361,,2017-011326,,"Erythroneura vitis",None,Iowa,Linn,2017-07-04,,"Wickiup Hill Outdoor Learning Area",42.087358,-91.767092,"Jim Durbin",adult,Blacklight/Fluorescent,Photograph,1,78,78,71,3,90,30.02,"partly cloudy","80% visible",
193591,,2017-011581,,"Erythroneura vitis",None,Iowa,Linn,2014-07-13,2045-2330,"Hitaga Sand Ridge Prairie Preserve",42.250957,-91.632098,"Jim Durbin",adult,Blacklight/Fluorescent,Photograph,1,74,67,63,3,300,,"partly cloudy",,
193626,,2017-011616,,"Erythroneura vitis",None,Iowa,Linn,2014-07-13,2045-2330,"Hitaga Sand Ridge Prairie Preserve",42.250957,-91.632098,"Jim Durbin",adult,Blacklight/Fluorescent,Photograph,1,74,67,63,3,300,,"partly cloudy",,
193945,,2017-011911,,"Erythroneura vitis",None,Iowa,Linn,2017-07-18,2045-2330,"Wickiup Hill Outdoor Learning Area",42.0876617,-91.767617,"Jim Durbin",adult,Blacklight/Fluorescent,Photograph,1,74,95,72,4,160,30,"partly cloudy","45 % visible",
193946,,2017-011912,,"Erythroneura vitis",None,Iowa,Linn,2017-07-18,2045-2330,"Wickiup Hill Outdoor Learning Area",42.0876617,-91.767617,"Jim Durbin",adult,Blacklight/Fluorescent,Photograph,1,74,95,72,4,160,30,"partly cloudy","45 % visible",
193953,,2017-011919,,"Erythroneura vitis",None,Iowa,Linn,2017-07-18,2045-2330,"Wickiup Hill Outdoor Learning Area",42.0876617,-91.767617,"Jim Durbin",adult,Blacklight/Fluorescent,Photograph,1,74,95,72,4,160,30,"partly cloudy","45 % visible",
193962,,2017-011928,,"Erythroneura vitis",None,Iowa,Linn,2017-07-18,2045-2330,"Wickiup Hill Outdoor Learning Area",42.0876617,-91.767617,"Jim Durbin",adult,Blacklight/Fluorescent,Photograph,1,74,95,72,4,160,30,"partly cloudy","45 % visible",
194009,,2017-011975,,"Erythroneura vitis",None,Iowa,Linn,2017-07-18,2045-2330,"Wickiup Hill Outdoor Learning Area",42.0876617,-91.767617,"Jim Durbin",adult,Blacklight/Fluorescent,Photograph,1,74,95,72,4,160,30,"partly cloudy","45 % visible",
194150,,2017-012116,,"Erythroneura vitis",None,Iowa,Linn,2017-07-22,2045-2330,"Hitaga Sand Ridge Prairie Preserve",42.250957,-91.632098,"Jim Durbin",adult,Blacklight/Fluorescent,Photograph,1,80,94,78,2,330,29.85,"partly cloudy","10 % visible",
194452,,2017-012417,,"Erythroneura vitis",None,Iowa,Linn,2017-07-29,2045-2315,"Hitaga Sand Ridge Prairie Preserve",42.250957,-91.632098,"Jim Durbin",adult,Blacklight/Fluorescent,Photograph,1,69,73,61,0,0,30.09,clear,"40% visible",
194495,,2017-012460,,"Erythroneura vitis",None,Iowa,Linn,2017-07-29,2045-2315,"Hitaga Sand Ridge Prairie Preserve",42.250957,-91.632098,"Jim Durbin",adult,Blacklight/Fluorescent,Photograph,1,69,73,61,0,0,30.09,clear,"40% visible",
194645,,2017-012609,,"Erythroneura vitis",None,Iowa,Linn,2017-08-01,2045-2300,"Matsell Bridge Natural Area",42.131126,-91.388999,"Jim Durbin",adult,Blacklight/Fluorescent,Photograph,1,83,91,57,5,210,30.03,cloudy,"50% visible",
195345,,2017-013309,,"Erythroneura vitis",None,Iowa,Linn,2017-08-14,2030-2300,"Hitaga Sand Ridge Prairie Preserve",42.250957,-91.632098,"Jim Durbin",adult,Blacklight/Fluorescent,Photograph,1,72,97,71,0,0,29.81,clear,"60% visible",
202383,,2018-000529,,"Erythroneura vitis",None,Iowa,Winneshiek,2011-08-23,,"100 Acre Wood-x",0,0,"MJ Hatfield",adult,,Photograph,1,,,,,,,,,
202597,,2018-000743,,"Erythroneura vitis",None,Iowa,Johnson,2017-07-17,,Redacted,Redacted,Redacted,"Mark Brown",adult,,Photograph,1,,,,,,,,,
208732,,2017-012418,,"Erythroneura vitis",None,Iowa,Linn,2017-07-29,2045-2315,"Hitaga Sand Ridge Prairie Preserve",42.250957,-91.632098,"Jim Durbin",adult,Blacklight/Fluorescent,Photograph,1,69,73,61,0,0,30.09,clear,"40% visible",
271183,,,,"Erythroneura vitis",None,Iowa,Story,2020-09-05,22:00:34,"Hertz Family Woods and Nature Preserve",41.98899391,-93.44316226,"Jim Durbin",adult,Blacklight/Fluorescent,Photograph,1,,,,,,,,,
290660,,,,"Erythroneura vitis",None,Iowa,Linn,2021-07-08,21:22:27,"Hitaga Sand Ridge Prairie Preserve",42.25145774,-91.63021403,"Jim Durbin",adult,Blacklight/Fluorescent,Photograph,1,69,73,60,5,90,29.89,"partly cloudy","5% visible",
291630,,,,"Erythroneura vitis",None,Iowa,Linn,2021-08-11,22:33:15,"Pleasant Creek State Recreation Area, Linn County",42.11043641,-91.82716239,"Jim Durbin",adult,Blacklight/Fluorescent,Photograph,1,84,66,72,6,270,29.66,"partly cloudy","10% visible",
291660,,,,"Erythroneura vitis",None,Iowa,Linn,2021-08-11,22:23:23,"Pleasant Creek State Recreation Area, Linn County",42.11043641,-91.82716239,"Jim Durbin",adult,Blacklight/Fluorescent,Photograph,1,84,66,72,6,270,29.66,"partly cloudy","10% visible",
291855,,,,"Erythroneura vitis",None,Iowa,Linn,2021-08-11,20:46:52,"Pleasant Creek State Recreation Area, Linn County",42.11043641,-91.82716239,"Jim Durbin",adult,Blacklight/Fluorescent,Photograph,1,84,66,72,6,270,29.66,"partly cloudy","10% visible",
291857,,,,"Erythroneura vitis",None,Iowa,Linn,2021-08-11,20:46:32,"Pleasant Creek State Recreation Area, Linn County",42.11043641,-91.82716239,"Jim Durbin",adult,Blacklight/Fluorescent,Photograph,1,84,66,72,6,270,29.66,"partly cloudy","10% visible",
294967,,,,"Erythroneura vitis",None,Iowa,Linn,2021-08-27,21:44:42,"Hitaga Sand Ridge Prairie Preserve",42.25082009,-91.63219999,"Jim Durbin",adult,Blacklight/Fluorescent,Photograph,1,85,80,78,4,90,29.93,clear,"80% visible",
312496,,,,"Erythroneura vitis",None,Iowa,Johnson,2022-07-23,20:42:08,"F. W. Kent Park",41.73491869,-91.72188289,"Jim Durbin",adult,Blacklight/Fluorescent,Pinned,1,88,65,74,12,190,29.81,cloudy,"40 % visible",
315512,,,,"Erythroneura vitis",None,Iowa,Johnson,2022-06-30,,Redacted,Redacted,Redacted,"Mark Brown",adult,Sighting,Photograph,1,,,,,,,,,
317681,,,,"Erythroneura vitis",None,Iowa,Johnson,2022-07-04,,Redacted,Redacted,Redacted,"Mark Brown",adult,Sighting,Photograph,1,,,,,,,,,
332001,,,,"Erythroneura vitis",None,Iowa,Johnson,2022-09-01,,Redacted,Redacted,Redacted,"Mark Brown",adult,Sighting,Photograph,1,,,,,,,,,
345186,,,,"Erythroneura vitis",None,Iowa,Johnson,2023-07-18,22:00:13,Redacted,Redacted,Redacted,"Mark Brown",adult,Sighting,Photograph,1,,,,,,,,,
