ID,"Collection / Source","Catalog Number","Specify Number",Taxon,"Common Name",State,County,Date,Time,Locale,Latitude,Longitude,Collector,"Life Stage","Collection Method","Preparation Type",Count,Temperature,Humidity,"Dew Point",Wind,"Wind Direction","Barometric Pressure",Sky,"Moon Phase",Notes
10603,,2014-010885,,"Ischyrus quadripunctatus","Four-Spotted Fungus Beetle",Iowa,Linn,2014-08-08,2030-2300DST,"Pleasant Creek State Recreation Area, Linn County",42.110327,-91.822988,"Jim Durbin",adult,Blacklight/Fluorescent,Photograph,1,72-69,79,62,Calm,,30.04,Clear,,
11525,,2014-011807,SPM039715,"Ischyrus quadripunctatus","Four-Spotted Fungus Beetle",Iowa,Linn,2014-05-07,,"Matsell Bridge Natural Area",42.13131,-91.38886,"Jim Durbin",adult,Blacklight/Fluorescent,Photograph,1,,,,,,,,,
11529,,2014-011811,SPM039750,"Ischyrus quadripunctatus","Four-Spotted Fungus Beetle",Iowa,Linn,2014-05-07,,"Matsell Bridge Natural Area",42.13131,-91.38886,"Jim Durbin",adult,Blacklight/Fluorescent,Photograph,1,,,,,,,,,
11541,"Jim Durbin Drawer 315-32",2014-011823,SPM039800,"Megalodacne heros",None,Iowa,Linn,2014-05-26,,"Wanatee County Park",42.01026,-91.57381,"Jim Durbin",adult,Sighting,Pinned,1,,,,,,,,,
18659,"Jim Durbin Drawer 315-27",2014-018982,SPM005048,"Ischyrus quadripunctatus","Four-Spotted Fungus Beetle",Iowa,Linn,2005-06-11,,"Wickiup Hill Outdoor Learning Area",42.08398,-91.7651,"Jim Durbin",adult,Blacklight/Fluorescent,Pinned,1,,,,,,,,,
18750,,2014-019073,SPM038725,"Ischyrus quadripunctatus","Four-Spotted Fungus Beetle",Iowa,Linn,2011-05-19,,"Wanatee County Park",42.0094,-91.56623,"Jim Durbin",adult,Blacklight/Fluorescent,Photograph,1,,,,,,,,,
32792,"Jim Durbin Drawer 315-27",2014-033164,SPM001239,"Ischyrus quadripunctatus","Four-Spotted Fungus Beetle",Iowa,Linn,2004-06-11,,"Wickiup Hill Outdoor Learning Area",42.08398,-91.7651,"Jim Durbin",adult,Blacklight,Pinned,1,,,,,,,,,
32793,"Jim Durbin Drawer 315-27",2014-033165,SPM001270,"Ischyrus quadripunctatus","Four-Spotted Fungus Beetle",Iowa,Linn,2004-05-03,,"Wickiup Hill Outdoor Learning Area",42.08398,-91.7651,"Jim Durbin",adult,Blacklight,Pinned,1,,,,,,,,,
32794,"Jim Durbin Drawer 315-27",2014-033166,SPM004036,"Ischyrus quadripunctatus","Four-Spotted Fungus Beetle",Iowa,Lee,2005-05-10,,"Shimek State Forest, Donnellson Unit",40.64833,-91.68057,"Jim Durbin",adult,Blacklight/Fluorescent,Pinned,1,,,,,,,,,
32795,"Jim Durbin Drawer 315-27",2014-033167,SPM017718,"Ischyrus quadripunctatus","Four-Spotted Fungus Beetle",Iowa,Linn,2010-05-24,,"Wanatee County Park",42.01026,-91.57381,"Jim Durbin",adult,Blacklight,Pinned,1,,,,,,,,,
32796,"Jim Durbin Drawer 315-27",2014-033168,SPM017720,"Ischyrus quadripunctatus","Four-Spotted Fungus Beetle",Iowa,Linn,2010-05-24,,"Wanatee County Park",42.01026,-91.57381,"Jim Durbin",adult,Blacklight,Pinned,1,,,,,,,,,
32797,"Jim Durbin Drawer 315-27",2014-033169,SPM021451,"Ischyrus quadripunctatus","Four-Spotted Fungus Beetle",Iowa,Linn,2011-05-23,,"Wanatee County Park",42.0094,-91.56623,"Jim Durbin",adult,Blacklight/Fluorescent,Pinned,1,,,,,,,,,
32798,,2014-033170,SPM021494,"Ischyrus quadripunctatus","Four-Spotted Fungus Beetle",Iowa,Linn,2011-05-30,,"Wanatee County Park",42.0094,-91.56623,"Jim Durbin",adult,Blacklight/Fluorescent,Photograph,1,,,,,,,,,
35690,"Jim Durbin Drawer 315-31",2014-036064,SPM001383,"Megalodacne faciata",None,Iowa,Linn,2004-07-16,,"Behren's Pond Woodland State Preserve",42.118214,-91.754324,"Jim Durbin",adult,Blacklight,Pinned,1,,,,,,,,,
36238,,2014-036612,SPM029822,"Ischyrus quadripunctatus","Four-Spotted Fungus Beetle",Iowa,Jones,2012-07-01,,"Wapsipinicon State Park",42.09038,-91.2861,"Jim Durbin",adult,Blacklight/Fluorescent,Photograph,1,,,,,,,,,
36250,,2014-036624,SPM038710,"Ischyrus quadripunctatus","Four-Spotted Fungus Beetle",Iowa,Story,2011-06-03,,"Hickory Grove Park",41.9876,-93.35129,"Jim Durbin",adult,Blacklight/Fluorescent,Photograph,1,,,,,,,,,
50133,,2014-050515,,"Megalodacne heros",None,Iowa,Linn,2014-08-18,2030-2300DST,"Wanatee County Park",42.01007,-91.566739,"Jim Durbin",adult,Blacklight/Fluorescent,Photograph,1,77-74,75-86,68,,,29.73,Clear,,
66073,,2014-066677,,"Acropteroxys gracilis","Slender Lizard Beetle",Iowa,Poweshiek,2014-06-29,,Grinnell,41.74306,-92.72222,"Mark Brown",adult,,Photograph,1,,,,,,,,,
66116,,2014-066720,,"Megalodacne heros",None,Iowa,Johnson,2014-06-21,,Redacted,Redacted,Redacted,"Mark Brown",adult,,Photograph,1,,,,,,,,,
110188,,2015-000744,,"Megalodacne faciata",None,Iowa,Johnson,2014-08-18,,"Along Manitou Trail-x",41.68435,-91.55424,"Mark Brown",adult,,Photograph,1,,,,,,,,,
122352,,2015-013002,,"Ischyrus quadripunctatus","Four-Spotted Fungus Beetle",Iowa,Linn,2015-04-16,"2030 to 2230","Wanatee County Park",42.0094,-91.56623,"Jim Durbin",adult,Blacklight/Fluorescent,Photograph,1,66,49,47,2,175,30.02,"10%  cloud cover","Waning Crescent",
122611,,2015-013172,,"Ischyrus quadripunctatus","Four-Spotted Fungus Beetle",Iowa,Linn,2015-05-02,,"Wanatee County Park",42.010091,-91.566619,"Jim Durbin",adult,Blacklight/Fluorescent,Photograph,1,65,66,53,4,180,29.89,"50 % Cloudy","Waxing Gibbous",
127805,,2015-018395,,"Megalodacne heros",None,Iowa,Linn,2014-05-26,,"Wanatee County Park",42.01026,-91.57381,"Jim Durbin",adult,Blacklight/Fluorescent,Photograph,1,,,,,,,,,
127911,,2015-018501,,"Ischyrus quadripunctatus","Four-Spotted Fungus Beetle",Iowa,Jackson,2015-07-10,2100-2330,"Prairie Creek Recreation Area",42.061696,-90.638097,"Jim Durbin",adult,Blacklight/Fluorescent,Photograph,1,75,80,60,6,120,30.14,clear,"20% visible",
128120,,2015-018710,,"Ischyrus quadripunctatus","Four-Spotted Fungus Beetle",Iowa,Linn,2015-07-16,2100-2300,"Matsell Bridge Natural Area",42.131959,-91.388307,"Jim Durbin",adult,Blacklight/Fluorescent,Photograph,1,75,100,74,2,190,29.74,"partly cloudy",Dark,
136403,,2016-000945,,"Languria trifasciata",None,Iowa,Johnson,2015-06-18,,"Hawkeye Willdlife Management Area",41.77465,-91.71518,"Mark Brown",adult,,Photograph,1,,,,,,,,,
136463,,2016-001005,,"Tritoma sanguinipennis","Red-winged Tritoma",Iowa,Johnson,2015-05-16,,"Hickory Hill Park",41.671722,-91.510372,"Mark Brown",adult,,Photograph,1,,,,,,,,,
137456,,2016-001999,,"Toramus pulchellus",None,Iowa,Johnson,2015-05-02,,"Hawkeye Willdlife Management Area",41.77465,-91.71518,"Mark Brown",adult,,Photograph,1,,,,,,,,,
137508,,2016-002051,,"Acropteroxys gracilis","Slender Lizard Beetle",Iowa,Poweshiek,2014-06-29,,Grinnell,41.74306,-92.72222,"Mark Brown",adult,,Photograph,1,,,,,,,,,
137535,,2016-002078,,"Dacne quadrimaculata",None,Iowa,Webster,2014-06-07,,"Dolliver Memorial State Park",42.3893,-94.0805,"Mark Brown",adult,,Photograph,1,,,,,,,,,
137548,,2016-002091,,"Ischyrus quadripunctatus","Four-Spotted Fungus Beetle",Iowa,Johnson,2014-05-27,,Redacted,Redacted,Redacted,"Mark Brown",adult,,Photograph,1,,,,,,,,,
137818,,2016-002362,,"Languria mozardi",None,Iowa,Johnson,2011-06-26,,"Terry Trueblood Recreation Area",41.624583,-91.528054,"Mark Brown",adult,,Photograph,1,,,,,,,,,
146882,,2016-011509,,"Ischyrus quadripunctatus","Four-Spotted Fungus Beetle",Iowa,Winneshiek,2015-07-19,,"100 Acre Wood-x",0,0,"MJ Hatfield",adult,,Photograph,1,,,,,,,,,
147021,,2016-011648,,"Ischyrus quadripunctatus","Four-Spotted Fungus Beetle",Iowa,Winneshiek,2015-07-26,,"100 Acre Wood-x",0,0,"MJ Hatfield",adult,,Photograph,1,,,,,,,,,
147136,,2016-011763,,"Ischyrus quadripunctatus","Four-Spotted Fungus Beetle",Iowa,Winneshiek,2010-07-26,,"100 Acre Wood-x",0,0,"MJ Hatfield",adult,,Photograph,1,,,,,,,,,
147159,,2016-011786,,"Loberus impressus",None,Iowa,Winneshiek,2010-07-26,,"100 Acre Wood-x",0,0,"MJ Hatfield",adult,,Photograph,1,,,,,,,,,
147482,,2016-012109,,"Cryptophilus seriatus",None,Iowa,Winneshiek,2013-07-26,,"Plymouth Rock-x",0,0,"MJ Hatfield",adult,,Photograph,1,,,,,,,,,
147523,,2016-012150,,"Acropteroxys gracilis","Slender Lizard Beetle",Iowa,Winneshiek,2012-06-24,,"100 Acre Wood-x",0,0,"MJ Hatfield",adult,,Photograph,1,,,,,,,,,
147688,,2016-012315,,"Acropteroxys gracilis","Slender Lizard Beetle",Iowa,Plymouth,2014-08-05,,"Spirit Knoll State Preserve",42.5949,-96.49129444,"MJ Hatfield",adult,,Photograph,1,,,,,,,,,
147724,,2016-012351,,"Tritoma sanguinipennis","Red-winged Tritoma",Iowa,Winneshiek,2008-06-17,,"Plymouth Rock-x",0,0,"MJ Hatfield",adult,,Photograph,1,,,,,,,,,
167100,,2016-031845,,"Ischyrus quadripunctatus","Four-Spotted Fungus Beetle",Iowa,Linn,2016-05-23,2030-2300,"Matsell Bridge Natural Area",42.131126,-91.388999,"Jim Durbin",adult,Blacklight/Fluorescent,Photograph,1,74,42,50,7,130,29.82,clear,Full,
167894,,2016-032639,,"Ischyrus quadripunctatus","Four-Spotted Fungus Beetle",Iowa,Linn,2016-05-29,2030-2300,"Vecny Woods",41.956725,-91.600854,"Jim Durbin",adult,Blacklight/Fluorescent,Photograph,1,76,54,58,0,180,29.94,"partly cloudy","80% visible","Very damp with short shower."
169486,,2016-034231,,"Ischyrus quadripunctatus","Four-Spotted Fungus Beetle",Iowa,Linn,2016-06-15,2100-2315,"Hitaga Sand Ridge Prairie Preserve",42.250957,-91.632098,"Jim Durbin",adult,Blacklight/Fluorescent,Photograph,1,83,56,66,8,310,29.74,clear,"90% visible",
170273,"Jim Durbin Drawer 349",2016-035018,,"Languria bicolor",None,Iowa,Decatur,2016-06-17,,Redacted,Redacted,Redacted,"Jim Durbin",adult,Blacklight/Florescent,Pinned,1,87,42,61,9,45,30.04,clear,,
182290,,2017-000251,,"Megalodacne faciata",None,Iowa,Johnson,2014-08-18,,Coralville,41.680218,-91.599614,"Mark Brown",adult,,Photograph,1,,,,,,,,,
186142,,2017-004103,,"Megalodacne faciata",None,Iowa,Johnson,2014-08-18,,"Along Manitou Trail-x",41.68435,-91.55424,"Mark Brown",adult,,Photograph,1,,,,,,,,,
186907,,2017-004868,,"Ischyrus quadripunctatus","Four-Spotted Fungus Beetle",Iowa,Johnson,2017-04-25,,Redacted,Redacted,Redacted,"Mark Brown",adult,,Photograph,1,,,,,,,,,
186917,,2017-004878,,"Languria angustata",None,Missouri,Carter,2017-04-21,,"Miller Community Lake State Wildlife Area",37.046926,-90.905689,"Mark Brown",adult,,Photograph,1,,,,,,,,,
192209,,2017-010170,,"Ischyrus quadripunctatus","Four-Spotted Fungus Beetle",Iowa,Linn,2017-06-03,2030-2330,"Wickiup Hill Outdoor Learning Area",42.087567,-91.767578,"Jim Durbin",adult,Blacklight/Fluorescent,Photograph,1,83,44,59,4,280,29.88,clear,"60% visible",
192694,,2017-010655,,"Ischyrus quadripunctatus","Four-Spotted Fungus Beetle",Iowa,Linn,2017-06-14,2100-2330,"Wickiup Hill Outdoor Learning Area",42.087567,-91.767578,"Jim Durbin",adult,Blacklight/Fluorescent,Photograph,1,80,73,71,3,120,29.75,cloudy,"90% visible",
193385,,2017-011350,,"Ischyrus quadripunctatus","Four-Spotted Fungus Beetle",Iowa,Linn,2017-07-04,,"Wickiup Hill Outdoor Learning Area",42.087358,-91.767092,"Jim Durbin",adult,Blacklight/Fluorescent,Photograph,1,78,78,71,3,90,30.02,"partly cloudy","80% visible",
209660,,2018-007817,,"Ischyrus quadripunctatus","Four-Spotted Fungus Beetle",Iowa,Linn,2018-05-04,"2030 - 2300","Wickiup Hill Outdoor Learning Area",42.087352,-91.767107,"Jim Durbin",adult,Blacklight/Fluorescent,Photograph,1,67,38,41,0,0,29.95,clear,"95% visible",
210291,,2018-008448,,"Ischyrus quadripunctatus","Four-Spotted Fungus Beetle",Iowa,Linn,2018-05-16,"2030 to 2300","Wanatee County Park",42.01026,-91.57381,"Jim Durbin",adult,Blacklight/Fluorescent,Photograph,1,72,45,50,1,100,29.86,clear,"0 visible",
211080,,2018-009237,,"Ischyrus quadripunctatus","Four-Spotted Fungus Beetle",Iowa,Linn,2018-05-24,2045-2300,"Matsell Bridge Natural Area",42.127011,-91.381076,"Jim Durbin",adult,Blacklight/Fluorescent,Photograph,1,82,54,,2,170,29.97,clear,"50% visible",
213845,,2018-012001,,"Ischyrus quadripunctatus","Four-Spotted Fungus Beetle",Iowa,Winneshiek,2018-05-23,,"100 Acre Wood-x",0,0,"MJ Hatfield",adult,"Blacklight Trap",Photograph,1,,,,,,,,,
215719,,2018-013875,,"Ischyrus quadripunctatus","Four-Spotted Fungus Beetle",Iowa,Winneshiek,2018-06-05,,"100 Acre Wood-x",0,0,"MJ Hatfield",adult,"Blacklight Trap",Photograph,1,,,,,,,,,
216170,,2018-014326,,"Ischyrus quadripunctatus","Four-Spotted Fungus Beetle",Iowa,Linn,2018-07-23,2100-2300,"Hitaga Sand Ridge Prairie Preserve",42.250957,-91.632098,"Jim Durbin",adult,Blacklight/Fluorescent,Photograph,1,78,62,64,1,275,29.98,clear,"80% visible",
216869,,2018-015025,,"Ischyrus quadripunctatus","Four-Spotted Fungus Beetle",Iowa,Winneshiek,2018-06-23,,"100 Acre Wood-x",0,0,"MJ Hatfield",adult,"Blacklight Trap",Photograph,1,,,,,,,,,
219806,,2018-018233,,"Ischyrus quadripunctatus","Four-Spotted Fungus Beetle",Iowa,Johnson,2018-05-14,,Redacted,Redacted,Redacted,"Mark Brown",adult,,Photograph,1,,,,,,,,,
229774,,2019-004488,,"Tritoma humeralis",None,Iowa,Jefferson,2018-07-17,,"Near Fairfield",41.0503,-92.024,"Moni Hayne",adult,,Photograph,1,,,,,,,,,
229994,,2019-004708,,"Megalodacne heros",None,Iowa,Jefferson,2018-07-25,,"Jefferson County Park",40.98639,-91.99111,"Moni Hayne",adult,,Photograph,1,,,,,,,,,
230483,,2019-005717,,"Ischyrus quadripunctatus","Four-Spotted Fungus Beetle",Iowa,Linn,2019-05-30,,"Hitaga Sand Ridge Prairie Preserve",42.250957,-91.632098,"Jim Durbin",adult,Blacklight/Fluorescent,Photograph,1,68,81,62,,,29.82,"partly cloidy","10% visible",
232243,,2019-006956,,"Ischyrus quadripunctatus","Four-Spotted Fungus Beetle",Iowa,Linn,2019-06-23,2100-2315,"Matsell Bridge Natural Area",42.132148,-91.385221,"Jim Durbin",adult,Blacklight/Fluorescent,Photograph,1,73,73,64,2,190,29.54,cloudy,"90% visible",
238452,,,,"Ischyrus quadripunctatus","Four-Spotted Fungus Beetle",Iowa,Johnson,2019-08-21,,"Sugar Bottom Recreational Area",41.761676,-91.554925,"Mark Brown",adult,"Building Light",Photograph,1,,,,,,,,,
247575,,,,"Ischyrus quadripunctatus","Four-Spotted Fungus Beetle",Iowa,Linn,2018-08-31,,"1460 Douglas Ct, Marion",42.040069,-91.590953,"Jim Durbin",adult,Sighting,Photograph,1,,,,,,,,,
263927,,,,"Toramus pulchellus",None,Iowa,Jefferson,2012-08-18,20:50:10,"Near Fairfield",41.050511,-92.023949,"Moni Hayne",adult,Sighting,Photograph,1,,,,,,,,,
263970,,,,"Ischyrus quadripunctatus","Four-Spotted Fungus Beetle",Iowa,Jefferson,2013-07-26,11:55:57,"Near Fairfield",41.050777,-92.023949,"Moni Hayne",adult,Sighting,Photograph,1,,,,,,,,,
264334,,,,"Ischyrus quadripunctatus","Four-Spotted Fungus Beetle",Iowa,Linn,2020-05-03,22:03:04,"Wickiup Hill Outdoor Learning Area",42.087605,-91.76766,"Jim Durbin",adult,Blacklight/Fluorescent,Photograph,1,66,,,,,,"partly cloudy","90% visible",
264373,,,,"Ischyrus quadripunctatus","Four-Spotted Fungus Beetle",Iowa,Linn,2020-05-03,22:03:04,"Wickiup Hill Outdoor Learning Area",42.087605,-91.76766,"Jim Durbin",adult,Blacklight/Fluorescent,Photograph,1,66,,,,,,"partly cloudy","90% visible",
264957,,,,"Ischyrus quadripunctatus","Four-Spotted Fungus Beetle",Iowa,Linn,2020-05-23,21:02:48,"Pinicon Ridge Park",42.21848617,-91.53895602,"Jim Durbin",adult,Blacklight/Fluorescent,Photograph,1,68,72,62,2,330,29.71,clear,"new moon",
272386,,,,"Ischyrus quadripunctatus","Four-Spotted Fungus Beetle",Iowa,Johnson,2020-08-24,23:07:22,Redacted,Redacted,Redacted,"Mark Brown",adult,Sighting,Photograph,1,,,,,,,,,
277778,,,,"Acropteroxys gracilis","Slender Lizard Beetle",Iowa,Linn,2020-06-17,,"Hitaga Sand Ridge Prairie Preserve",42.249894,-91.630026,"Mark Brown",adult,Sighting,Photograph,1,,,,,,,,,
287023,,,,"Triplax flavicollis",None,Iowa,Johnson,2020-06-06,,"F. W. Kent Park",41.7266792,-91.73239629,"Mark Brown",adult,Sighting,Photograph,1,,,,,,,,,
287241,,,,"Triplax flavicollis",None,Iowa,Johnson,2020-06-20,,"F. W. Kent Park",41.736329,-91.721945,"Mark Brown",adult,Sighting,Photograph,1,,,,,,,,,
295279,,,,"Ischyrus quadripunctatus","Four-Spotted Fungus Beetle",Iowa,Johnson,2021-07-18,22:47:20,Redacted,Redacted,Redacted,"Mark Brown",adult,Sighting,Photograph,1,,,,,,,,,
295396,,,,"Ischyrus quadripunctatus","Four-Spotted Fungus Beetle",Iowa,Johnson,2021-07-05,22:42:05,Redacted,Redacted,Redacted,"Mark Brown",adult,Sighting,Photograph,1,,,,,,,,,
295602,,,,"Ischyrus quadripunctatus","Four-Spotted Fungus Beetle",Iowa,Johnson,2021-06-27,23:26:47,Redacted,Redacted,Redacted,"Mark Brown",adult,Sighting,Photograph,1,,,,,,,,,
298002,,,,"Acropteroxys gracilis","Slender Lizard Beetle",Iowa,Johnson,2021-07-25,,"F. W. Kent Park",41.735678,-91.722354,"Mark Brown",adult,Sighting,Photograph,1,,,,,,,,,
310202,,,,"Toramus pulchellus",None,Iowa,Linn,2022-06-12,20:10:23,"Pinicon Ridge Park",42.21093766,-91.54432936,"Jim Durbin",adult,Sighting,Photograph,1,79,78,70,0,0,29.85,clear,full,
310717,,,,"Acropteroxys gracilis","Slender Lizard Beetle",Iowa,Linn,2022-06-25,13:48:41,"1460 Douglas Ct, Marion",42.040069,-91.590953,"Jim Durbin",adult,Sighting,Photograph,3,,,,,,,,,
314660,,,,"Ischyrus quadripunctatus","Four-Spotted Fungus Beetle",Iowa,Johnson,2022-05-10,22:27:06,Redacted,Redacted,Redacted,"Mark Brown",adult,Sighting,Photograph,1,,,,,,,,,
314847,,,,"Tritoma sanguinipennis","Red-winged Tritoma",Iowa,Warren,2022-05-28,,"Lake Ahquabi State Park",41.294535,-93.593795,"Mark Brown",adult,Sighting,Photograph,1,,,,,,,,,
315427,,,,"Ischyrus quadripunctatus","Four-Spotted Fungus Beetle",Iowa,Johnson,2022-05-31,22:26:32,Redacted,Redacted,Redacted,"Mark Brown",adult,Sighting,Photograph,1,,,,,,,,,
320153,,,,"Toramus pulchellus",None,Iowa,Johnson,2022-07-10,,Redacted,Redacted,Redacted,"Mark Brown",adult,Sighting,Photograph,1,,,,,,,,,
320252,,,,"Megalodacne heros",None,Iowa,Johnson,2022-07-12,,"MacBride Nature Recreation Area",41.786818,-91.568342,"Mark Brown",adult,Sighting,Photograph,1,,,,,,,,,
320606,,,,"Ischyrus quadripunctatus","Four-Spotted Fungus Beetle",Iowa,Johnson,2022-07-20,6:06:23,Redacted,Redacted,Redacted,"Mark Brown",adult,Sighting,Photograph,1,,,,,,,,,
332341,,,,"Ischyrus quadripunctatus","Four-Spotted Fungus Beetle",Iowa,Johnson,2022-08-10,22:10:55,Redacted,Redacted,Redacted,"Mark Brown",adult,Sighting,Photograph,1,,,,,,,,,
335111,,,,"Acropteroxys gracilis","Slender Lizard Beetle",Iowa,Buchanan,2023-06-17,11:33:57,"Patton Prairie",42.552721,-91.763015,"Kenneth Heiar",adult,Sighting,Photograph,1,,,,,,,,,
340376,,,,"Toramus pulchellus",None,Iowa,Linn,2023-08-20,21:21:28,"Pinicon Ridge Park",42.21852826,-91.53878734,"Jim Durbin",adult,Blacklight/Fluorescent,Photograph,1,87,73,77,2,360,30.09,"partly cloudy","10% visible",
341992,,,,"Languria mozardi",None,Iowa,Johnson,2023-05-21,,"F. W. Kent Park",41.732348,-91.726823,"Mark Brown",adult,Sighting,Photograph,1,,,,,,,,,
342007,,,,"Languria mozardi",None,Iowa,Polk,2023-05-27,,"Union Park",41.611866,-93.608397,"Mark Brown",adult,Sighting,Photograph,1,,,,,,,,,
342174,,,,"Ischyrus quadripunctatus","Four-Spotted Fungus Beetle",Iowa,Johnson,2023-05-09,21:51:59,Redacted,Redacted,Redacted,"Mark Brown",adult,Sighting,Photograph,1,,,,,,,,,
342467,,,,"Ischyrus quadripunctatus","Four-Spotted Fungus Beetle",Iowa,Johnson,2023-06-06,22:11:09,Redacted,Redacted,Redacted,"Mark Brown",adult,Sighting,Photograph,1,,,,,,,,,
347301,,,,"Acropteroxys gracilis","Slender Lizard Beetle",Iowa,Allamakee,2023-07-15,13:05:05,"Yellow River State Forest",43.170837383333,-91.23674128,"Mark Brown",adult,Sighting,Photograph,1,,,,,,,,,
