ID,"Collection / Source","Catalog Number","Specify Number",Taxon,"Common Name",State,County,Date,Time,Locale,Latitude,Longitude,Collector,"Life Stage","Collection Method","Preparation Type",Count,Temperature,Humidity,"Dew Point",Wind,"Wind Direction","Barometric Pressure",Sky,"Moon Phase",Notes
218358,,2018-016514,,"Bryotropha branella",None,Iowa,Linn,2018-08-11,2030-2300,"Hitaga Sand Ridge Prairie Preserve",42.250604,-91.629962,"Jim Durbin",adult,Blacklight/Fluorescent,Photograph,1,74,81,68,5,45,30.06,clear,dark,
218413,,2018-016569,,"Bryotropha branella",None,Iowa,Linn,2018-08-11,2030-2300,"Hitaga Sand Ridge Prairie Preserve",42.250604,-91.629962,"Jim Durbin",adult,Blacklight/Fluorescent,Photograph,1,74,81,68,5,45,30.06,clear,dark,
219327,,2018-017483,,"Bryotropha branella",None,Iowa,Linn,2018-08-25,2015-2300,"Hitaga Sand Ridge Prairie Preserve",42.250604,-91.629962,"Jim Durbin",adult,Blacklight/Fluorescent,Photograph,1,74,97,73,3,310,29.91,cdlear,"Full Moon",
231931,,2019-006644,,"Bryotropha branella",None,Iowa,Linn,2019-06-17,2100-2300,"Hitaga Sand Ridge Prairie Preserve",42.250957,-91.632098,"Jim Durbin",adult,Blacklight/Fluorescent,Photograph,1,71,68,60,5,110,29.97,cloudy,full,
231935,,2019-006648,,"Bryotropha branella",None,Iowa,Linn,2019-06-17,2100-2300,"Hitaga Sand Ridge Prairie Preserve",42.250957,-91.632098,"Jim Durbin",adult,Blacklight/Fluorescent,Photograph,1,71,68,60,5,110,29.97,cloudy,full,
232174,,2019-006887,,"Bryotropha branella",None,Iowa,Linn,2019-06-23,2100-2315,"Matsell Bridge Natural Area",42.132148,-91.385221,"Jim Durbin",adult,Blacklight/Fluorescent,Photograph,1,73,73,64,2,190,29.54,cloudy,"90% visible",
232596,,2019-007309,,"Bryotropha branella",None,Iowa,Linn,2019-06-26,"50% visible","Hitaga Sand Ridge Prairie Preserve",42.250957,-91.632098,"Jim Durbin",adult,Blacklight/Fluorescent,Photograph,1,79,69,68,1,100,29.79,clear,,
234437,,,,"Bryotropha branella",None,Iowa,Linn,2019-07-23,2100-2315,"Hitaga Sand Ridge Prairie Preserve",42.251284,-91.630087,"Jim Durbin",adult,Blacklight/Fluorescent,Photograph,1,75,56,58,3,275,30.11,clear,new,
234623,,,,"Bryotropha branella",None,Iowa,Linn,2019-07-23,2100-2315,"Hitaga Sand Ridge Prairie Preserve",42.251284,-91.630087,"Jim Durbin",adult,Blacklight/Fluorescent,Photograph,1,75,56,58,3,275,30.11,clear,new,
247073,,,,"Bryotropha branella",None,Iowa,Linn,2019-09-02,2000-2300,"Matsell Bridge Natural Area",42.131959,-91.388307,"Jim Durbin",adult,Blacklight/Fluorescent,Photograph,1,77,77,67,4,135,29.85,"parthly cloudy","10% visible",
290371,,,,"Bryotropha branella",None,Iowa,Linn,2021-07-08,22:28:34,"Hitaga Sand Ridge Prairie Preserve",42.25145774,-91.63021403,"Jim Durbin",adult,Blacklight/Fluorescent,Photograph,1,69,73,60,5,90,29.89,"partly cloudy","5% visible",
290449,,,,"Bryotropha branella",None,Iowa,Linn,2021-07-08,22:11:11,"Hitaga Sand Ridge Prairie Preserve",42.25145774,-91.63021403,"Jim Durbin",adult,Blacklight/Fluorescent,Photograph,1,69,73,60,5,90,29.89,"partly cloudy","5% visible",
320178,,,,"Bryotropha branella",None,Iowa,Johnson,2022-06-19,,Redacted,Redacted,Redacted,"Mark Brown",adult,Sighting,Photograph,1,,,,,,,,,
338154,,,,"Bryotropha branella",None,Iowa,Muscatine,2023-07-18,23:09:19,"Big Sand Mound Prairie Preserve, Muscatine County",41.34026787,-91.08103262,"Jim Durbin",adult,Blacklight/Fluorescent,Photograph,1,72,70,62,0,90,29.99,"partly cloudy","new moon",
