ID,"Collection / Source","Catalog Number","Specify Number",Taxon,"Common Name",State,County,Date,Time,Locale,Latitude,Longitude,Collector,"Life Stage","Collection Method","Preparation Type",Count,Temperature,Humidity,"Dew Point",Wind,"Wind Direction","Barometric Pressure",Sky,"Moon Phase",Notes
42,"Frank Olsen Drawer 25",2014-000042,SPM010401,"Tetracis crocallata","Yellow Slant-line",Iowa,Linn,2007-05-10,,"J. Harold Ennis County Park",41.898488,-91.483092,"Frank Olsen",adult,,Pinned,1,,,,,,,,,"Located at Iowa State"
43,"Frank Olsen Drawer 25",2014-000043,SPM010402,"Tetracis crocallata","Yellow Slant-line",Iowa,Linn,2007-05-18,,"Pinicon Ridge Park",42.21188,-91.54753,"Frank Olsen",adult,,Pinned,1,,,,,,,,,"Located at Iowa State"
1042,"Frank Olsen Drawer 25",2014-001042,SPM010401,"Tetracis crocallata","Yellow Slant-line",Iowa,Linn,2007-05-10,,"J. Harold Ennis County Park",41.898488,-91.483092,"Frank Olsen",adult,,Pinned,1,,,,,,,,,"Located at Iowa State"
1043,"Frank Olsen Drawer 25",2014-001043,SPM010402,"Tetracis crocallata","Yellow Slant-line",Iowa,Linn,2007-05-18,,"Pinicon Ridge Park",42.21188,-91.54753,"Frank Olsen",adult,,Pinned,1,,,,,,,,,"Located at Iowa State"
11604,"Jim Durbin Drawer 065",2014-011886,SPM040091,"Tetracis cachexiata","Yellow Slant Line Moth",Iowa,Fremont,2014-05-24,,"Waubonsie State Park",40.676,-95.689,"Tom Jantscher",adult,,Pinned,1,,,,,,,,,
26130,"Jim Durbin Drawer 065",2014-026478,SPM004944,"Tetracis crocallata","Yellow Slant-line",Iowa,Linn,2005-07-01,,"Behren's Pond Woodland State Preserve",42.118214,-91.754324,"Jim Durbin",adult,Blacklight/Fluorescent,Pinned,1,,,,,,,,,
47692,"Jim Durbin Drawer 065",2014-048070,SPM003983,"Tetracis cachexiata","Yellow Slant Line Moth",Iowa,Lee,2005-05-10,,"Shimek State Forest, Donnellson Unit",40.64833,-91.68057,"Jim Durbin",adult,Blacklight/Fluorescent,Pinned,1,,,,,,,,,
47693,"Jim Durbin Drawer 065",2014-048071,SPM008573,"Tetracis cachexiata","Yellow Slant Line Moth",Kentucky,Ohio,2007-05-04,,"Leon's Farm, Ohio County",37.42033,-86.77023,"Jim Durbin",adult,Blacklight/Fluorescent,Pinned,1,,,,,,,,,
47694,"Jim Durbin Drawer 065",2014-048072,SPM015097,"Tetracis crocallata","Yellow Slant-line",Iowa,Fremont,2009-08-09,,"Waubonsie State Park",40.676,-95.689,"Jim Durbin",adult,Blacklight/Fluorescent,Pinned,1,,,,,,,,,
47695,"Jim Durbin Drawer 065",2014-048073,SPM015620,"Tetracis crocallata","Yellow Slant-line",Iowa,Muscatine,2009-08-04,,"Shady Creek Recreation Area",41.44813,-90.8732,"Jim Durbin",adult,Blacklight/Fluorescent,Pinned,1,,,,,,,,,
47696,"Jim Durbin Drawer 065",2014-048074,SPM018173,"Tetracis cachexiata","Yellow Slant Line Moth","West Virginia",Fayette,2010-06-14,,"Babcock State Park",38.00821,-80.94937,"Jim Durbin",adult,Blacklight/Fluorescent,Pinned,1,,,,,,,,,
47697,"Jim Durbin Drawer 065",2014-048075,SPM000619,"Tetracis crocallata","Yellow Slant-line",Iowa,Lee,2004-05-11,,"Shimek State Forest, Donnellson Unit",40.64833,-91.68057,"Jim Durbin",adult,Blacklight/Fluorescent,Pinned,1,,,,,,,,,
47698,"Frank Olsen Drawer 25",2014-048076,SPM002254,"Tetracis crocallata","Yellow Slant-line",Iowa,"Van Buren",2004-05-08,,"Shimek State Forest, Farmington Unit",40.64802,-91.7254,"Frank Olsen",adult,,Pinned,1,,,,,,,,,"Located at Iowa State"
47699,"Frank Olsen Drawer 25",2014-048077,SPM002255,"Tetracis crocallata","Yellow Slant-line",Iowa,"Van Buren",2004-05-08,,"Shimek State Forest, Farmington Unit",40.64802,-91.7254,"Frank Olsen",adult,,Pinned,1,,,,,,,,,"Located at Iowa State"
47700,"Frank Olsen Drawer 25",2014-048078,SPM002256,"Tetracis crocallata","Yellow Slant-line",Iowa,Linn,2003-05-30,,"Wanatee County Park",42.00994,-91.57749,"Frank Olsen",adult,,Pinned,1,,,,,,,,,"Located at Iowa State"
47701,,2014-048079,SPM003592,"Tetracis crocallata","Yellow Slant-line",Iowa,Jasper,2003-05-15,,"Neal Smith National Wildlife Refuge",41.5678,-93.2675,"Keith Summerville",adult,,Pinned,1,,,,,,,,,
47702,"Jim Durbin Drawer 065",2014-048080,SPM003986,"Tetracis crocallata","Yellow Slant-line",Iowa,Lee,2005-05-10,,"Shimek State Forest, Donnellson Unit",40.64833,-91.68057,"Jim Durbin",adult,Blacklight/Fluorescent,Pinned,1,,,,,,,,,
47703,"Jim Durbin Drawer 065",2014-048081,SPM003999,"Tetracis crocallata","Yellow Slant-line",Iowa,Lee,2005-05-10,,"Shimek State Forest, Donnellson Unit",40.64833,-91.68057,"Jim Durbin",adult,Blacklight/Fluorescent,Pinned,1,,,,,,,,,
47704,"Jim Durbin Drawer 065",2014-048082,SPM004002,"Tetracis crocallata","Yellow Slant-line",Iowa,Lee,2005-05-10,,"Shimek State Forest, Donnellson Unit",40.64833,-91.68057,"Jim Durbin",adult,Blacklight/Fluorescent,Pinned,1,,,,,,,,,
47705,"Jim Durbin Drawer 065",2014-048083,SPM004031,"Tetracis crocallata","Yellow Slant-line",Iowa,"Van Buren",2005-05-11,,"Shimek State Forest, Farmington Unit",40.6659,-91.73637,"Jim Durbin",adult,Blacklight/Fluorescent,Pinned,1,,,,,,,,,
47706,"Jim Durbin Drawer 065",2014-048084,SPM006208,"Tetracis crocallata","Yellow Slant-line",Kentucky,Hancock,2006-05-31,,"Bob Durbin Ray Road",37.868842,-86.89109,"Jim Durbin",adult,Blacklight/Fluorescent,Pinned,1,,,,,,,,,
47707,"Jim Durbin Drawer 065",2014-048085,SPM006306,"Tetracis crocallata","Yellow Slant-line",Minnesota,Cook,2006-06-17,,"Golden Eagle Lodge",48.05537,-90.39812,"Jim Durbin",adult,Blacklight/Fluorescent,Pinned,1,,,,,,,,,
47708,"Jim Durbin Drawer 065",2014-048086,SPM009103,"Tetracis crocallata","Yellow Slant-line",Iowa,Linn,2007-07-26,,"J. Harold Ennis County Park",41.8985,-91.482862,"Jim Durbin",adult,Blacklight/Fluorescent,Pinned,1,,,,,,,,,
47709,"Jim Durbin Drawer 065",2014-048087,SPM011631,"Tetracis crocallata","Yellow Slant-line",Iowa,Linn,2008-07-30,,Redacted,Redacted,Redacted,"Jim Durbin",adult,Blacklight/Fluorescent,Pinned,1,,,,,,,,,
47710,"Frank Olsen Drawer 25",2014-048088,SPM012676,"Tetracis crocallata","Yellow Slant-line",Iowa,Linn,2008-07-23,,"Hanging Bog State Preserve",42.0333365,-91.767999,"Frank Olsen",adult,,Pinned,1,,,,,,,,,"Located at Iowa State"
47712,"Jim Durbin Drawer 065",2014-048090,SPM013809,"Tetracis crocallata","Yellow Slant-line",Iowa,Linn,2009-06-03,,Redacted,Redacted,Redacted,"Jim Durbin",adult,Blacklight/Fluorescent,Pinned,1,,,,,,,,,
47713,"Jim Durbin Drawer 065",2014-048091,SPM013854,"Tetracis crocallata","Yellow Slant-line",Iowa,Linn,2009-06-04,,Redacted,Redacted,Redacted,"Jim Durbin",adult,Blacklight/Fluorescent,Pinned,1,,,,,,,,,
47714,"Jim Durbin Drawer 065",2014-048092,SPM013937,"Tetracis crocallata","Yellow Slant-line",Kentucky,Ohio,2009-06-12,,"Leon's Farm, Ohio County",37.42033,-86.77023,"Jim Durbin",adult,Blacklight/Fluorescent,Pinned,1,,,,,,,,,
47716,"Jim Durbin Drawer 065",2014-048094,SPM014161,"Tetracis crocallata","Yellow Slant-line",Iowa,Linn,2009-07-01,,"Wickiup Hill Outdoor Learning Area",42.08398,-91.7651,"Jim Durbin",adult,Blacklight/Fluorescent,Pinned,1,,,,,,,,,
47717,"Jim Durbin Drawer 065",2014-048095,SPM014178,"Tetracis crocallata","Yellow Slant-line",Iowa,Linn,2009-07-01,,"Wickiup Hill Outdoor Learning Area",42.08398,-91.7651,"Jim Durbin",adult,Blacklight/Fluorescent,Pinned,1,,,,,,,,,
47718,"Jim Durbin Drawer 065",2014-048096,SPM014198,"Tetracis crocallata","Yellow Slant-line",Iowa,Linn,2009-07-02,,"Wickiup Hill Outdoor Learning Area",42.08398,-91.7651,"Jim Durbin",adult,Blacklight/Fluorescent,Pinned,1,,,,,,,,,
47720,"Frank Olsen Drawer 25",2014-048098,SPM016301,"Tetracis crocallata","Yellow Slant-line",Iowa,Linn,2009-08-15,,"Pleasant Creek State Recreation Area, Linn County",42.11952,-91.81215,"Frank Olsen",adult,,Pinned,1,,,,,,,,,"Located at Iowa State"
47721,"Jim Durbin Drawer 065",2014-048099,SPM017489,"Tetracis crocallata","Yellow Slant-line",Iowa,Linn,2010-05-18,,"Wanatee County Park",42.01026,-91.57381,"Jim Durbin",adult,Blacklight/Fluorescent,Pinned,1,,,,,,,,,
47722,,2014-048100,SPM021797,"Tetracis crocallata","Yellow Slant-line",Iowa,"Van Buren",2011-06-05,,"Shimek State Forest, Farmington Unit",40.6659,-91.73637,"Jim Durbin",adult,Blacklight/Fluorescent,Photograph,1,,,,,,,,,
47723,"Frank Olsen Drawer 25",2014-048101,SPM024367,"Tetracis crocallata","Yellow Slant-line",Iowa,"Black Hawk",2011-07-30,,"Cedar Hills Sand Prairie Preserve",42.59305,-92.55315,"Frank Olsen",adult,,Pinned,1,,,,,,,,,"Located at Iowa State"
47724,"Frank Olsen Drawer 25",2014-048102,SPM024368,"Tetracis crocallata","Yellow Slant-line",Iowa,Linn,2011-05-23,,"Matsell Bridge Natural Area",42.13131,-91.38886,"Frank Olsen",adult,,Pinned,1,,,,,,,,,"Located at Iowa State"
47725,,2014-048103,SPM025332,"Tetracis crocallata","Yellow Slant-line",Iowa,Polk,2011-05-18,,"Puccoon Prairie",41.73528,-93.36417,"Keith Summerville",adult,,Sighting,1,,,,,,,,,
47726,,2014-048104,SPM025803,"Tetracis crocallata","Yellow Slant-line",Iowa,Polk,2011-05-18,,"Chichaqua Bottoms Sandhill Prairie",41.77278,-93.385,"Keith Summerville",adult,,Sighting,1,,,,,,,,,
67113,"Frank Olsen Drawer 25",2014-067718,,"Tetracis crocallata","Yellow Slant-line",Iowa,Allamakee,2014-05-29,,"Yellow River State Forest",43.16786,-91.25393,"Frank Olsen",adult,,Pinned,1,,,,,,,,,"Located at Iowa State"
71611,,2014-072218,,"Tetracis crocallata","Yellow Slant-line",Iowa,Polk,2005-05-25,,"Synder Farm INHF",41.76675,-93.484171,"Keith Summerville",adult,,Sighting,1,,,,,,,,,
71612,,2014-072219,,"Tetracis crocallata","Yellow Slant-line",Iowa,Polk,2004-05-25,,"Chichaqua Bottoms Sandhill Prairie",41.77278,-93.385,"Keith Summerville",adult,,Sighting,3,,,,,,,,,
125731,,2015-016299,,"Tetracis cachexiata","Yellow Slant Line Moth",Iowa,Monona,2015-05-29,,"Sylvan Runkel State Preserve",42.102085,-95.971013,"Jim Durbin",adult,Blacklight/Fluorescent,Photograph,1,,,,,,,,,
128677,,2015-019267,,"Tetracis cachexiata","Yellow Slant Line Moth",Iowa,Monona,2014-05-31,,"Sylvan Runkel State Preserve",42.10805556,-95.97388889,"MJ Hatfield",adult,,Photograph,1,,,,,,,,,
132948,"Frank Olsen Drawer 25",2015-023542,,"Tetracis crocallata","Yellow Slant-line",Iowa,Linn,2015-05-28,,"Wanatee County Park",42.00994,-91.57749,"Frank Olsen",adult,,Pinned,1,,,,,,,,,"Located at Iowa State"
133930,"Paul Martsching Collection",2015-024524,,"Tetracis crocallata","Yellow Slant-line",Iowa,Story,2006-07-26,,"Ames, Paul",42.02064,-93.623952,"Paul Martsching",adult,"Building Light",Pinned,1,,,,,,,,,
145241,,2016-009862,,"Tetracis crocallata","Yellow Slant-line",Iowa,Allamakee,2015-05-06,,Redacted,Redacted,Redacted,"Kyle E. Johnson",adult,,,1,68,,,,,," mostly cloudy/light wind, showers prior",,"ridgeline dry-mesic Quercus-Carya deciduous woodland overlooking bluff prairie and river course"
146578,,2016-011205,,"Tetracis crocallata","Yellow Slant-line",Iowa,Winneshiek,2015-06-07,,"100 Acre Wood-x",0,0,"MJ Hatfield",adult,,Photograph,1,,,,,,,,,
167086,,2016-031831,,"Tetracis crocallata","Yellow Slant-line",Iowa,Linn,2016-05-19,,"Hitaga Sand Ridge Prairie Preserve",42.250957,-91.632098,"Jim Durbin",adult,Blacklight/Florescent,Photograph,1,59,63,46,0,110,30.06,Clear,"95% visible",
167263,,2016-032008,,"Tetracis crocallata","Yellow Slant-line",Iowa,Linn,2016-05-23,2030-2300,"Matsell Bridge Natural Area",42.131126,-91.388999,"Jim Durbin",adult,Blacklight/Florescent,Photograph,1,74,42,50,7,130,29.82,clear,Full,
168078,,2016-032823,,"Tetracis crocallata","Yellow Slant-line",Iowa,Linn,2016-05-31,1030-2300,"Hitaga Sand Ridge Prairie Preserve",42.250957,-91.632098,"Jim Durbin",adult,Blacklight/Florescent,Photograph,1,66,100,65,0,0,29.89,cloudy,"30% visible","1030-2300. Rained for about 45 minutes."
168125,,2016-032870,,"Tetracis crocallata","Yellow Slant-line",Iowa,Linn,2016-05-31,1030-2300,"Hitaga Sand Ridge Prairie Preserve",42.250957,-91.632098,"Jim Durbin",adult,Blacklight/Florescent,Photograph,1,66,100,65,0,0,29.89,cloudy,"30% visible","1030-2300. Rained for about 45 minutes."
169059,,2016-033804,,"Tetracis cachexiata","Yellow Slant Line Moth",Iowa,Linn,2016-06-08,2048-2300,"Hitaga Sand Ridge Prairie Preserve",42.250957,-91.632098,"Jim Durbin",adult,Blacklight/Fluorescent,Photograph,1,75,48,53,0,120,29.88,cloudy,"10% visible",
169079,,2016-033824,,"Tetracis cachexiata","Yellow Slant Line Moth",Iowa,Linn,2016-06-08,2048-2300,"Hitaga Sand Ridge Prairie Preserve",42.250957,-91.632098,"Jim Durbin",adult,Blacklight/Fluorescent,Photograph,1,75,48,53,0,120,29.88,cloudy,"10% visible",
171568,,2016-036313,,"Tetracis crocallata","Yellow Slant-line",Iowa,Linn,2016-07-05,2100-2300,"Hitaga Sand Ridge Prairie Preserve",42.250957,-91.632098,"Jim Durbin",adult,Blacklight/Fluorescent,Photograph,1,80,88,75,4,150,29.76,cloudy,Dark,
184801,,2017-002763,,"Tetracis crocallata","Yellow Slant-line",Iowa,Jefferson,2016-07-27,,"Jefferson County Park",40.98639,-91.99111,"Moni Hayne",adult,Blacklight/Fluorescent,Photograph,1,,,,,,,,,
197492,"Paul Martsching Collection",2017-015426,,"Tetracis crocallata","Yellow Slant-line",Iowa,Story,2017-08-06,,"Ames, Paul",42.02064,-93.623952,"Paul Martsching",adult,"Building Light",Pinned,1,,,,,,,,,
200618,,2017-018550,,"Tetracis crocallata","Yellow Slant-line",Iowa,Scott,2016-05-30,,Davenport,41.5278,-90.5844,"Ken Wellnitz",adult,,Photograph,1,,,,,,,,,
215794,,2018-013950,,"Tetracis crocallata","Yellow Slant-line",Iowa,Winneshiek,2018-06-06,,"100 Acre Wood-x",0,0,"MJ Hatfield",adult,"Blacklight Trap",Photograph,1,,,,,,,,,
215797,,2018-013953,,"Tetracis cachexiata","Yellow Slant Line Moth",Iowa,Winneshiek,2018-06-06,,"100 Acre Wood-x",0,0,"MJ Hatfield",adult,"Blacklight Trap",Photograph,1,,,,,,,,,
215821,,2018-013977,,"Tetracis cachexiata","Yellow Slant Line Moth",Iowa,Winneshiek,2018-06-06,,"100 Acre Wood-x",0,0,"MJ Hatfield",adult,"Blacklight Trap",Photograph,1,,,,,,,,,
215877,,2018-014033,,"Tetracis cachexiata","Yellow Slant Line Moth",Iowa,Winneshiek,2018-06-08,,"100 Acre Wood-x",0,0,"MJ Hatfield",adult,"Blacklight Trap",Photograph,1,,,,,,,,,
215949,,2018-014105,,"Tetracis cachexiata","Yellow Slant Line Moth",Iowa,Winneshiek,2018-06-12,,"100 Acre Wood-x",0,0,"MJ Hatfield",adult,"Blacklight Trap",Photograph,1,,,,,,,,,
216592,,2018-014748,,"Tetracis cachexiata","Yellow Slant Line Moth",Iowa,Winneshiek,2018-06-17,,"100 Acre Wood-x",0,0,"MJ Hatfield",adult,"Blacklight Trap",Photograph,1,,,,,,,,,
220957,,2018-019111,,"Tetracis crocallata","Yellow Slant-line",Iowa,Winneshiek,2018-08-14,,"100 Acre Wood-x",0,0,"MJ Hatfield",adult,"Blacklight Trap",Photograph,1,,,,,,,,,
230537,,2019-005771,,"Tetracis crocallata","Yellow Slant-line",Iowa,Linn,2019-05-30,,"Hitaga Sand Ridge Prairie Preserve",42.250957,-91.632098,"Jim Durbin",adult,Blacklight/Fluorescent,Photograph,1,68,81,62,,,29.82,"partly cloidy","10% visible",
239118,"Paul Martsching Collection",2019-009103,,"Tetracis crocallata","Yellow Slant-line",Iowa,Story,2019-06-08,3:30,"Ames, Paul",42.02064,-93.623952,"Paul Martsching",adult,"Building Light",Pinned,1,,,,,,,,,
249198,,,,"Tetracis cachexiata","Yellow Slant Line Moth",Iowa,Story,2011-07-29,,"McFarland Park",42.094838,-93.572673,"Moni Hayne",adult,Blacklight/Fluorescent,Photograph,1,,,,,,,,,
264501,,,,"Tetracis crocallata","Yellow Slant-line",Iowa,Linn,2020-05-15,,"Hitaga Sand Ridge Prairie Preserve",42.250881,-91.632144,"Jim Durbin",adult,Blacklight/Fluorescent,Photograph,1,60,85,56,0,0,30.01,clear,"50% visible",
264512,,,,"Tetracis crocallata","Yellow Slant-line",Iowa,Linn,2020-05-15,,"Hitaga Sand Ridge Prairie Preserve",42.250881,-91.632144,"Jim Durbin",adult,Blacklight/Fluorescent,Photograph,1,60,85,56,0,0,30.01,clear,"50% visible",
264683,,,,"Tetracis cachexiata","Yellow Slant Line Moth","West Virginia",Preston,2010-06-04,15:47:52,"Cranesville Swamp Natural Area",39.534999,-79.483655,"Jim Durbin",adult,Sighting,Photograph,1,,,,,,,,,
265892,,,,"Tetracis cachexiata","Yellow Slant Line Moth",Iowa,Linn,2020-06-07,21:25:39,"Wickiup Hill Outdoor Learning Area",42.08736536,-91.76707659,"Jim Durbin",adult,Sighting,Photograph,1,81,49,60,4,170,29.77,clear,full,
266760,,,,"Tetracis cachexiata","Yellow Slant Line Moth",Iowa,Linn,2020-06-12,22:10:01,"Hitaga Sand Ridge Prairie Preserve",42.2508675,-91.63209427,"Jim Durbin",adult,Blacklight/Fluorescent,Photograph,1,76,48,55,0,0,30.17,"partly cloudy","80% visible",
266769,,,,"Tetracis cachexiata","Yellow Slant Line Moth",Iowa,Linn,2020-06-12,22:07:50,"Hitaga Sand Ridge Prairie Preserve",42.2508675,-91.63209427,"Jim Durbin",adult,Blacklight/Fluorescent,Photograph,1,76,48,55,0,0,30.17,"partly cloudy","80% visible",
270099,,,,"Tetracis crocallata","Yellow Slant-line",Iowa,Johnson,2020-07-28,6:12:41,"MacBride Nature Recreation Area",41.78672811,-91.56848566,"Mark Brown",adult,Sighting,Photograph,1,,,,,,,,,
272578,"Paul Martsching Collection",2020-000159,,"Tetracis crocallata","Yellow Slant-line",Iowa,Story,2020-05-30,,"Ames, Paul",42.016779,-93.616948,"Paul Martsching",adult,"Building Light",Pinned,1,,,,,,,,,
279354,,,,"Tetracis crocallata","Yellow Slant-line",Iowa,Johnson,2020-07-21,,"MacBride Nature Recreation Area",41.786961,-91.568504,"Mark Brown",adult,Sighting,Photograph,1,,,,,,,,,
289261,,,,"Tetracis cachexiata","Yellow Slant Line Moth",Iowa,Story,2021-06-29,7:21:59,"Ada Hayden Heritage Park",42.074527,-93.631966,"Wolfgang Oesterreich",adult,Sighting,Photograph,1,72,87,68,3,W,30.12,"mostly cloudy",,"At Ada Hayden Heritage Park, along east side of Jensen Pond"
289768,,,,"Tetracis cachexiata","Yellow Slant Line Moth",Iowa,Linn,2021-07-03,23:02:52,"Pinicon Ridge Park",42.21096962,-91.54429747,"Jim Durbin",adult,Blacklight/Fluorescent,Photograph,1,79,57,63,3,190,29.9,clear,"50% visible",
312348,,,,"Tetracis crocallata","Yellow Slant-line",Iowa,Johnson,2022-07-23,22:10:57,"F. W. Kent Park",41.73491869,-91.72188289,"Jim Durbin",adult,Blacklight/Fluorescent,Photograph,1,88,65,74,12,190,29.81,cloudy,"40 % visible",
356234,,,,"Tetracis crocallata","Yellow Slant-line",Iowa,Winneshiek,2018-06-05,,"Hickory Ridge Woods",43.3178,-91.7959,"Lena Schmitt",adult,,,1,,,,,,,,,"Data from Kirk Larsen, Luther College"
356235,,,,"Tetracis crocallata","Yellow Slant-line",Iowa,Winneshiek,2018-08-07,,"Hickory Ridge Woods",43.3178,-91.7959,"Lena Schmitt",adult,,,1,,,,,,,,,"Data from Kirk Larsen, Luther College"
356236,,,,"Tetracis crocallata","Yellow Slant-line",Iowa,Winneshiek,2018-08-07,,"Hickory Ridge Woods",43.3178,-91.7959,"Lena Schmitt",adult,,,1,,,,,,,,,"Data from Kirk Larsen, Luther College"
357095,,,,"Tetracis crocallata","Yellow Slant-line",Iowa,Winneshiek,2018-06-06,,"Lionberger Environmental Preserve",43.334148,-91.871215,"Lena Schmitt",adult,,,1,,,,,,,,,"Data from Kirk Larsen, Luther College"
358783,,,,"Tetracis cachexiata","Yellow Slant Line Moth",Iowa,Winneshiek,2018-06-06,,"Roslien Woods",43.3244,-91.8216,"Lena Schmitt",adult,,,1,,,,,,,,,"Data from Kirk Larsen, Luther College"
