ID,"Collection / Source","Catalog Number","Specify Number",Taxon,"Common Name",State,County,Date,Time,Locale,Latitude,Longitude,Collector,"Life Stage","Collection Method","Preparation Type",Count,Temperature,Humidity,"Dew Point",Wind,"Wind Direction","Barometric Pressure",Sky,"Moon Phase",Notes
122668,,2015-013235,,"Nomada ruficornis",None,Iowa,Jones,2015-05-01,,"Westphal Timber, Jones",42.13475,-90.9556,"Jim Durbin",adult,Blacklight/Fluorescent,Photograph,1,,,,,,,,,
144667,,2016-009289,,"Nomada ruficornis",None,Iowa,Johnson,2015-06-27,,"Hawkeye Willdlife Management Area",41.77465,-91.71518,"Mark Brown",adult,,Photograph,1,,,,,,,,,
147533,,2016-012160,,"Nomada articulata",None,Iowa,Winneshiek,2014-07-03,,"100 Acre Wood-x",0,0,"MJ Hatfield",adult,,Photograph,1,,,,,,,,,
184361,,2017-002322,,"Nomada erigeronis",None,Iowa,Polk,2014-06-28,,"Big Creek State Park",41.807055,-93.745185,"Mark Brown",adult,,Photograph,1,,,,,,,,,
264262,,,,"Nomada ruficornis",None,Iowa,Winneshiek,2019-10-07,,"Decorah Community Prairie",43.301308,-91.803304,"Larry Reis",adult,Sighting,Photograph,1,,,,,,,,,
266351,,,,"Nomada ruficornis",None,Iowa,Linn,2020-06-11,8:40:55,"1460 Douglas Ct, Marion",42.040069,-91.590953,"Jim Durbin",adult,Sighting,Photograph,1,,,,,,,,,
310620,,,,"Nomada ruficornis",None,Iowa,Linn,2022-05-11,8:57:37,"1460 Douglas Ct, Marion",42.040069,-91.590953,"Jim Durbin",adult,Sighting,Photograph,2,,,,,,,,,
314837,,,,"Nomada ruficornis",None,Iowa,Warren,2022-05-28,,"Lake Ahquabi State Park",41.294535,-93.593795,"Mark Brown",adult,Sighting,Photograph,1,,,,,,,,,
321149,,,,"Nomada undetermined",None,Iowa,"Van Buren",2022-04-23,,"Lacey-Keosauqua State Park",40.711116,-91.979143,"Jay Gilliam",adult,Sighting,Photograph,1,,,,,,,,,"Lacey-Keosauqua State Park.  Could only get to Nomad Bee sp on iNat"
341452,,,,"Nomada vicina",None,Iowa,Johnson,2022-09-11,,"Terry Trueblood Recreation Area",41.622005,-91.533488,"Mark Brown",adult,Sighting,Photograph,1,,,,,,,,,
348453,,,,"Nomada ruficornis",None,Iowa,Tama,2023-05-28,08:48:39,"Hickory Hills Park, Tama County",42.266196,-92.306426,"Kenneth Heiar",adult,Sighting,Photograph,1,,,,,,,,,
349451,,,,"Nomada undetermined",None,Iowa,Lee,2023-04-29,,"Shimek State Forest, Lick Creek Unit",40.611139,-91.676547,"Mark Brown",adult,Sighting,Photograph,1,,,,,,,,,
349452,,,,"Nomada undetermined",None,Iowa,Lee,2023-04-29,,"Shimek State Forest, Lick Creek Unit",40.611139,-91.676547,"Mark Brown",adult,Sighting,Photograph,1,,,,,,,,,
354483,,,,Nomada,None,Iowa,Winneshiek,2015-05-28,,"Decorah Community Prairie",43.3015,-91.8025,"Isaac Jensen",adult,,,1,,,,,,,,,"Data from Kirk Larsen, Luther College"
354484,,,,"Nomada depressa",None,Iowa,Winneshiek,2015-05-28,,"Decorah Community Prairie",43.3015,-91.8025,"Isaac Jensen",adult,,,1,,,,,,,,,"Data from Kirk Larsen, Luther College"
354485,,,,"Nomada erigeronis",None,Iowa,Winneshiek,2015-07-27,,"Decorah Community Prairie",43.3015,-91.8025,"Isaac Jensen",adult,,,1,,,,,,,,,"Data from Kirk Larsen, Luther College"
354486,,,,"Nomada obliterata",None,Iowa,Winneshiek,2015-05-28,,"Decorah Community Prairie",43.3015,-91.8025,"Isaac Jensen",adult,,,1,,,,,,,,,"Data from Kirk Larsen, Luther College"
354487,,,,"Nomada texana",None,Iowa,Winneshiek,2018-08-14,,"Decorah Community Prairie",43.3015,-91.8025,"Mike Arduser",adult,,,1,,,,,,,,,"Data from Kirk Larsen, Luther College"
355546,,,,Nomada,None,Iowa,Winneshiek,2015-05-29,,"Spilde Woods",43.317783,-91.812417,"Isaac Jensen",adult,,,1,,,,,,,,,"Data from Kirk Larsen, Luther College"
355547,,,,"Nomada articulata",None,Iowa,Winneshiek,2015-05-27,,"Spilde Woods",43.317783,-91.812417,"Isaac Jensen",adult,,,1,,,,,,,,,"Data from Kirk Larsen, Luther College"
355548,,,,"Nomada australis",None,Iowa,Winneshiek,2015-05-29,,"Spilde Woods",43.317783,-91.812417,"Isaac Jensen",adult,,,1,,,,,,,,,"Data from Kirk Larsen, Luther College"
355549,,,,"Nomada depressa",None,Iowa,Winneshiek,2015-05-29,,"Spilde Woods",43.317783,-91.812417,"Isaac Jensen",adult,,,1,,,,,,,,,"Data from Kirk Larsen, Luther College"
355625,,,,"Nomada articulata",None,Iowa,Howard,2015-06-16,,"Hayden Prairie State Wildlife Management Area",43.44166667,-92.38333333,"Isaac Jensen",adult,,,1,,,,,,,,,"Data from Kirk Larsen, Luther College"
355626,,,,"Nomada australis",None,Iowa,Howard,2015-06-16,,"Hayden Prairie State Wildlife Management Area",43.44166667,-92.38333333,"Isaac Jensen",adult,,,1,,,,,,,,,"Data from Kirk Larsen, Luther College"
357335,,,,"Nomada articulata",None,Iowa,Winneshiek,2015-06-19,,"Ludwig Preserve",43.194,-91.979,"Isaac Jensen",adult,,,1,,,,,,,,,"Data from Kirk Larsen, Luther College"
357336,,,,"Nomada australis",None,Iowa,Winneshiek,2015-05-28,,"Ludwig Preserve",43.194,-91.979,"Isaac Jensen",adult,,,1,,,,,,,,,"Data from Kirk Larsen, Luther College"
357337,,,,"Nomada australis",None,Iowa,Winneshiek,2015-05-28,,"Ludwig Preserve",43.194,-91.979,"Isaac Jensen",adult,,,1,,,,,,,,,"Data from Kirk Larsen, Luther College"
357375,,,,"Nomada australis",None,Iowa,Winneshiek,2015-05-28,,"Ludwig Preserve",43.194,-91.979,"Isaac Jensen",adult,,,1,,,,,,,,,"Data from Kirk Larsen, Luther College"
358015,,,,Nomada,None,Iowa,Winneshiek,2015-05-27,,"Plymouth Rock",43.43766667,-92.00583333,"Isaac Jensen",adult,,,1,,,,,,,,,"Data from Kirk Larsen, Luther College"
358016,,,,Nomada,None,Iowa,Winneshiek,2015-05-27,,"Plymouth Rock",43.43766667,-92.00583333,"Isaac Jensen",adult,,,1,,,,,,,,,"Data from Kirk Larsen, Luther College"
358017,,,,Nomada,None,Iowa,Winneshiek,2015-05-27,,"Plymouth Rock",43.43766667,-92.00583333,"Isaac Jensen",adult,,,1,,,,,,,,,"Data from Kirk Larsen, Luther College"
366747,,,,"Nomada undetermined",None,Iowa,Linn,2024-06-02,10:19:55,"1460 Douglas Ct, Marion",42.040085996667,-91.590924046667,"Jim Durbin",adult,Sighting,Photograph,1,,,,,,,,,
367302,,,,"Nomada ruficornis",None,Iowa,Linn,2024-06-12,13:58:35,"1460 Douglas Ct, Marion",42.040058486667,-91.590917085,"Jim Durbin",adult,Sighting,Photograph,1,,,,,,,,,
