ID,"Collection / Source","Catalog Number","Specify Number",Taxon,"Common Name",State,County,Date,Time,Locale,Latitude,Longitude,Collector,"Life Stage","Collection Method","Preparation Type",Count,Temperature,Humidity,"Dew Point",Wind,"Wind Direction","Barometric Pressure",Sky,"Moon Phase",Notes
1478,,2014-001478,,"Renia flavipunctalis","Yellow-spotted Renia Moth",Iowa,Linn,2014-07-31,,"Pleasant Creek State Recreation Area, Linn County",42.110327,-91.822988,"Jim Durbin",adult,Blacklight/Fluorescent,Photograph,1,,,,,,,,,
12356,,2014-012638,SPM042743,"Renia flavipunctalis","Yellow-spotted Renia Moth",Iowa,Linn,2014-07-21,,"Pleasant Creek State Recreation Area, Linn County",42.10948,-91.8249,"Jim Durbin",adult,Blacklight/Fluorescent,Photograph,1,,,,,,,,,
17813,,2014-018113,SPM029354,"Renia flavipunctalis","Yellow-spotted Renia Moth",Iowa,Linn,2012-06-22,,"Behren's Pond Woodland State Preserve",42.118214,-91.754324,"Jim Durbin",adult,Blacklight/Fluorescent,Photograph,1,,,,,,,,,
17825,,2014-018125,SPM035905,"Renia flavipunctalis","Yellow-spotted Renia Moth",Iowa,Lee,2013-08-09,,"Shimek State Forest, Lick Creek Unit",40.612832,-91.676971,"Jim Durbin",adult,Blacklight/Fluorescent,Photograph,1,,,,,,,,,
30482,,2014-030850,SPM042570,"Renia flavipunctalis","Yellow-spotted Renia Moth",Iowa,Linn,2014-07-21,,"Pleasant Creek State Recreation Area, Linn County",42.10948,-91.8249,"Jim Durbin",adult,Blacklight/Fluorescent,Photograph,1,,,,,,,,,
44773,"Jim Durbin Drawer 115",2014-045150,SPM004951,"Renia flavipunctalis","Yellow-spotted Renia Moth",Iowa,Linn,2005-07-01,,"Behren's Pond Woodland State Preserve",42.118214,-91.754324,"Jim Durbin",adult,Blacklight/Fluorescent,Pinned,1,,,,,,,,,
44798,,2014-045175,SPM003689,"Renia flavipunctalis","Yellow-spotted Renia Moth",Iowa,Jasper,2003-05-15,,"Neal Smith National Wildlife Refuge",41.5678,-93.2675,"Keith Summerville",adult,,Pinned,1,,,,,,,,,
44809,"Jim Durbin Drawer 115",2014-045186,SPM013448,"Renia flavipunctalis","Yellow-spotted Renia Moth",Iowa,Dubuque,2006-07-06,,"White Pine Hollow State Preserve",42.62803,-91.09843,"MJ Hatfield",adult,,Pinned,1,,,,,,,,,
44823,"Frank Olsen Drawer 50",2014-045200,SPM037885,"Renia flavipunctalis","Yellow-spotted Renia Moth",Iowa,Clarke,2013-08-03,,"Red Fern Timber",40.98317,-93.75317,"Frank Olsen",adult,,Pinned,1,,,,,,,,,"Located at Iowa State"
44824,"Frank Olsen Drawer 50",2014-045201,SPM037886,"Renia flavipunctalis","Yellow-spotted Renia Moth",Iowa,Linn,2013-07-29,,"Matsell Bridge Natural Area",42.13131,-91.38886,"Frank Olsen",adult,,Pinned,1,,,,,,,,,"Located at Iowa State"
108399,,2014-109146,,"Renia flavipunctalis","Yellow-spotted Renia Moth",Iowa,Allamakee,2014-07-13,,"Black Hawk Point Wildlife Management Area",43.4555556,-91.28,"Tom Jantscher",adult,,Photograph,1,,,,,,,,,"Rich mature woods within steep bluffs overlooking Mississippi River valley"
109037,"Frank Olsen Drawer 50",2014-109427,,"Renia flavipunctalis","Yellow-spotted Renia Moth",Iowa,Guthrie,2014-07-30,,"Sheeder Prairie State Preserve",41.689003,-94.587724,"Frank Olsen",adult,,Pinned,1,,,,,,,,,"Located at Iowa State"
110268,,2015-000824,,"Renia flavipunctalis","Yellow-spotted Renia Moth",Iowa,Webster,2014-07-13,,"Dolliver Memorial State Park",42.3893,-94.0805,"Mark Brown",adult,,Photograph,1,,,,,,,,,
120509,,2015-010892,,"Renia flavipunctalis","Yellow-spotted Renia Moth",Iowa,Jefferson,2014-07-23,,"Jefferson County Park",40.993,-91.987,"Moni Hayne",adult,Blacklight/Fluorescent,Photograph,1,,,,,,,,,
128029,"Jim Durbin Drawer 115",2015-018619,,"Renia flavipunctalis","Yellow-spotted Renia Moth",Iowa,Jackson,2015-07-10,2100-2330,"Prairie Creek Recreation Area",42.061696,-90.638097,"Jim Durbin",adult,Blacklight/Fluorescent,Pinned,1,75,80,60,6,120,30.14,clear,"20% visible",
128130,,2015-018720,,"Renia flavipunctalis","Yellow-spotted Renia Moth",Iowa,Linn,2015-07-16,2100-2300,"Matsell Bridge Natural Area",42.131959,-91.388307,"Jim Durbin",adult,Blacklight/Fluorescent,Photograph,1,75,100,74,2,190,29.74,"partly cloudy",Dark,
128987,,2015-019577,,"Renia flavipunctalis","Yellow-spotted Renia Moth",Iowa,Carroll,2012-07-26,,"Hobbs County Area",42.167377,-94.714633,"Eileen Miller",adult,,Photograph,1,,,,,,,,,
135813,,2016-000355,,"Renia flavipunctalis","Yellow-spotted Renia Moth",Iowa,Story,2005-07-14,,"McFarland Park",42.092878,-93.571,"Paul Martsching",adult,"Building Light",Photograph,1,,,,,,,,,
170972,,2016-035717,,"Renia flavipunctalis","Yellow-spotted Renia Moth",Iowa,Linn,2016-06-27,2100-2330,"Hitaga Sand Ridge Prairie Preserve",42.250957,-91.632098,"Jim Durbin",adult,Blacklight/Fluorescent,Photograph,1,77,59,62,4,300,30.06,"partly cloudy","50% visible",
170989,,2016-035734,,"Renia flavipunctalis","Yellow-spotted Renia Moth",Iowa,Linn,2016-06-27,2100-2330,"Hitaga Sand Ridge Prairie Preserve",42.250957,-91.632098,"Jim Durbin",adult,Blacklight/Fluorescent,Photograph,1,77,59,62,4,300,30.06,"partly cloudy","50% visible",
171069,,2016-035814,,"Renia flavipunctalis","Yellow-spotted Renia Moth",Iowa,Linn,2016-06-27,2100-2330,"Hitaga Sand Ridge Prairie Preserve",42.250957,-91.632098,"Jim Durbin",adult,Blacklight/Fluorescent,Photograph,1,77,59,62,4,300,30.06,"partly cloudy","50% visible",
171855,,2016-036600,,"Renia flavipunctalis","Yellow-spotted Renia Moth",Iowa,Linn,2016-07-09,2100-2330,"Hitaga Sand Ridge Prairie Preserve",42.250957,-91.632098,"Jim Durbin",adult,Blacklight/Fluorescent,Photograph,1,72,83,66,0,0,30.01,clear,"30% visible",
171871,,2016-036616,,"Renia flavipunctalis","Yellow-spotted Renia Moth",Iowa,Linn,2016-07-14,2100-2330,"Hitaga Sand Ridge Prairie Preserve",42.250957,-91.632098,"Jim Durbin",adult,Blacklight/Fluorescent,Photograph,1,71,74,62,2,345,29.92,clear,"80% visible",
172023,,2016-036768,,"Renia flavipunctalis","Yellow-spotted Renia Moth",Iowa,Linn,2016-07-14,2100-2330,"Hitaga Sand Ridge Prairie Preserve",42.250957,-91.632098,"Jim Durbin",adult,Blacklight/Fluorescent,Photograph,1,71,74,62,2,345,29.92,clear,"80% visible",
172077,,2016-036822,,"Renia flavipunctalis","Yellow-spotted Renia Moth",Iowa,Linn,2016-07-14,2100-2330,"Hitaga Sand Ridge Prairie Preserve",42.250957,-91.632098,"Jim Durbin",adult,Blacklight/Fluorescent,Photograph,1,71,74,62,2,345,29.92,clear,"80% visible",
172125,,2016-036870,,"Renia flavipunctalis","Yellow-spotted Renia Moth",Iowa,Linn,2016-07-14,2100-2330,"Hitaga Sand Ridge Prairie Preserve",42.250957,-91.632098,"Jim Durbin",adult,Blacklight/Fluorescent,Photograph,1,71,74,62,2,345,29.92,clear,"80% visible",
172198,,2016-036943,,"Renia flavipunctalis","Yellow-spotted Renia Moth",Iowa,Linn,2016-07-20,2100-2330,"Hitaga Sand Ridge Prairie Preserve",42.250957,-91.632098,"Jim Durbin",adult,Blacklight/Fluorescent,Photograph,1,81,90,77,5,180,30.01,cloudy,full,
172244,,2016-036989,,"Renia flavipunctalis","Yellow-spotted Renia Moth",Iowa,Linn,2016-07-20,2100-2330,"Hitaga Sand Ridge Prairie Preserve",42.250957,-91.632098,"Jim Durbin",adult,Blacklight/Fluorescent,Photograph,1,81,90,77,5,180,30.01,cloudy,full,
172926,,2016-037671,,"Renia flavipunctalis","Yellow-spotted Renia Moth",Iowa,Linn,2016-07-24,,"Hitaga Sand Ridge Prairie Preserve",42.250957,-91.632098,"Jim Durbin",adult,Blacklight/Fluorescent,Photograph,1,77,70,66,,300,29.9,"partly cloudy","90% visible",
173387,,2016-038133,,"Renia flavipunctalis","Yellow-spotted Renia Moth",Iowa,Linn,2016-08-03,2100-2330,"Hitaga Sand Ridge Prairie Preserve",42.250957,-91.632098,"Jim Durbin",adult,Blacklight/Fluorescent,Photograph,1,81,74,71,3,180,29.96,clear,Dark,
184749,,2017-002711,,"Renia flavipunctalis","Yellow-spotted Renia Moth",Iowa,Jefferson,2016-07-27,,"Jefferson County Park",40.98639,-91.99111,"Moni Hayne",adult,Blacklight/Fluorescent,Photograph,1,,,,,,,,,
184884,,2017-002846,,"Renia flavipunctalis","Yellow-spotted Renia Moth",Iowa,Jefferson,2016-07-27,,"Jefferson County Park",40.98639,-91.99111,"Moni Hayne",adult,Blacklight/Fluorescent,Photograph,1,,,,,,,,,
193106,,2017-011071,,"Renia flavipunctalis","Yellow-spotted Renia Moth",Iowa,Linn,2017-07-01,,"Hitaga Sand Ridge Prairie Preserve",42.250957,-91.632098,"Jim Durbin",adult,Blacklight/Fluorescent,Photograph,1,72,56,55,280,9,29.97,clear,,
193715,,2017-011705,,"Renia flavipunctalis","Yellow-spotted Renia Moth",Iowa,Linn,2014-07-13,2045-2330,"Hitaga Sand Ridge Prairie Preserve",42.250957,-91.632098,"Jim Durbin",adult,Blacklight/Fluorescent,Photograph,1,74,67,63,3,300,,"partly cloudy",,
193753,,2017-011744,,"Renia flavipunctalis","Yellow-spotted Renia Moth",Iowa,Linn,2014-07-13,2045-2330,"Hitaga Sand Ridge Prairie Preserve",42.250957,-91.632098,"Jim Durbin",adult,Blacklight/Fluorescent,Photograph,1,74,67,63,3,300,,"partly cloudy",,
193755,,2017-011746,,"Renia flavipunctalis","Yellow-spotted Renia Moth",Iowa,Linn,2014-07-13,2045-2330,"Hitaga Sand Ridge Prairie Preserve",42.250957,-91.632098,"Jim Durbin",adult,Blacklight/Fluorescent,Photograph,1,74,67,63,3,300,,"partly cloudy",,
193793,,2017-011784,,"Renia flavipunctalis","Yellow-spotted Renia Moth",Iowa,Linn,2014-07-13,2045-2330,"Hitaga Sand Ridge Prairie Preserve",42.250957,-91.632098,"Jim Durbin",adult,Blacklight/Fluorescent,Photograph,1,74,67,63,3,300,,"partly cloudy",,
201561,,2017-019490,,"Renia flavipunctalis","Yellow-spotted Renia Moth",Iowa,Jefferson,2017-07-27,,"Jefferson County Park",40.98639,-91.99111,"Moni Hayne",adult,Blacklight/Fluorescent,Photograph,1,,,,,,,,,
205071,,2018-003219,,"Renia flavipunctalis","Yellow-spotted Renia Moth",Iowa,Story,2005-07-14,,"Ames, Paul",42.02064,-93.623952,"Paul Martsching",adult,"Building Light",Sighting,1,,,,,,,,,
209875,,2018-008032,,"Renia flavipunctalis","Yellow-spotted Renia Moth",Iowa,Jefferson,2016-07-24,,"Near Fairfield",41.0503,-92.024,"Moni Hayne",adult,Blacklight/Fluorescent,Photograph,1,,,,,,,,,
212882,,2018-011039,,"Renia flavipunctalis","Yellow-spotted Renia Moth",Iowa,Linn,2018-06-23,2100-2330,"Hitaga Sand Ridge Prairie Preserve",42.250957,-91.632098,"Jim Durbin",adult,Blacklight/Fluorescent,Photograph,1,68,85,63,5,180,29.81,"partly cloudy","80% visible",
214243,,2018-012399,,"Renia flavipunctalis","Yellow-spotted Renia Moth",Iowa,Linn,2018-07-09,2100-2330,"Hitaga Sand Ridge Prairie Preserve",42.250957,-91.632098,"Jim Durbin",adult,Blacklight/Fluorescent,Photograph,1,80,79,73,0,0,30.11,clear,"20% visible",
214274,,2018-012430,,"Renia flavipunctalis","Yellow-spotted Renia Moth",Iowa,Linn,2018-07-09,2100-2330,"Hitaga Sand Ridge Prairie Preserve",42.250957,-91.632098,"Jim Durbin",adult,Blacklight/Fluorescent,Photograph,1,80,79,73,0,0,30.11,clear,"20% visible",
214336,,2018-012492,,"Renia flavipunctalis","Yellow-spotted Renia Moth",Iowa,Linn,2018-07-09,2100-2330,"Hitaga Sand Ridge Prairie Preserve",42.250957,-91.632098,"Jim Durbin",adult,Blacklight/Fluorescent,Photograph,1,80,79,73,0,0,30.11,clear,"20% visible",
214375,,2018-012531,,"Renia flavipunctalis","Yellow-spotted Renia Moth",Iowa,Linn,2018-07-09,2100-2330,"Hitaga Sand Ridge Prairie Preserve",42.250957,-91.632098,"Jim Durbin",adult,Blacklight/Fluorescent,Photograph,1,80,79,73,0,0,30.11,clear,"20% visible",
214999,,2018-013155,,"Renia flavipunctalis","Yellow-spotted Renia Moth",Iowa,Johnson,2018-07-09,,"MacBride Nature Recreation Area",41.786729,-91.568057,"Mark Brown",adult,,Sighting,1,,,,,,,,,
215610,,2018-013767,,"Renia flavipunctalis","Yellow-spotted Renia Moth",Iowa,Linn,2018-07-18,2100-2300,"Wickiup Hill Outdoor Learning Area",42.087352,-91.767107,"Jim Durbin",adult,Blacklight/Fluorescent,Photograph,1,75,68,64,4,100,29.98,"partly cloudy","15 % visible",
216160,,2018-014316,,"Renia flavipunctalis","Yellow-spotted Renia Moth",Iowa,Linn,2018-07-23,2100-2300,"Hitaga Sand Ridge Prairie Preserve",42.250957,-91.632098,"Jim Durbin",adult,Blacklight/Fluorescent,Photograph,1,78,62,64,1,275,29.98,clear,"80% visible",
216206,,2018-014362,,"Renia flavipunctalis","Yellow-spotted Renia Moth",Iowa,Linn,2018-07-23,2100-2300,"Hitaga Sand Ridge Prairie Preserve",42.250957,-91.632098,"Jim Durbin",adult,Blacklight/Fluorescent,Photograph,1,78,62,64,1,275,29.98,clear,"80% visible",
216232,,2018-014388,,"Renia flavipunctalis","Yellow-spotted Renia Moth",Iowa,Linn,2018-07-23,2100-2300,"Hitaga Sand Ridge Prairie Preserve",42.250957,-91.632098,"Jim Durbin",adult,Blacklight/Fluorescent,Photograph,1,78,62,64,1,275,29.98,clear,"80% visible",
216250,,2018-014406,,"Renia flavipunctalis","Yellow-spotted Renia Moth",Iowa,Linn,2018-07-23,2100-2300,"Hitaga Sand Ridge Prairie Preserve",42.250957,-91.632098,"Jim Durbin",adult,Blacklight/Fluorescent,Photograph,1,78,62,64,1,275,29.98,clear,"80% visible",
216252,,2018-014408,,"Renia flavipunctalis","Yellow-spotted Renia Moth",Iowa,Linn,2018-07-23,2100-2300,"Hitaga Sand Ridge Prairie Preserve",42.250957,-91.632098,"Jim Durbin",adult,Blacklight/Fluorescent,Photograph,1,78,62,64,1,275,29.98,clear,"80% visible",
216263,,2018-014419,,"Renia flavipunctalis","Yellow-spotted Renia Moth",Iowa,Linn,2018-07-23,2100-2300,"Hitaga Sand Ridge Prairie Preserve",42.250957,-91.632098,"Jim Durbin",adult,Blacklight/Fluorescent,Photograph,1,78,62,64,1,275,29.98,clear,"80% visible",
220249,,2018-018405,,"Renia flavipunctalis","Yellow-spotted Renia Moth",Iowa,Linn,2018-09-11,1945-2300,"Hitaga Sand Ridge Prairie Preserve",42.25095,-91.63209,"Jim Durbin",adult,Blacklight/Fluorescent,Photograph,1,73,64,60,2,110,30.02,clear,dark,
225517,,2019-000429,,"Renia flavipunctalis","Yellow-spotted Renia Moth",Iowa,Johnson,2018-07-09,,"MacBride Nature Recreation Area",41.786729,-91.568057,"Mark Brown",adult,,Photograph,1,,,,,,,,,
234393,,,,"Renia flavipunctalis","Yellow-spotted Renia Moth",Iowa,Linn,2019-07-23,2100-2315,"Hitaga Sand Ridge Prairie Preserve",42.251284,-91.630087,"Jim Durbin",adult,Blacklight/Fluorescent,Photograph,1,75,56,58,3,275,30.11,clear,new,
270059,,,,"Renia flavipunctalis","Yellow-spotted Renia Moth",Iowa,Johnson,2020-07-31,6:07:41,"MacBride Nature Recreation Area",41.78672811,-91.56848566,"Mark Brown",adult,Sighting,Photograph,1,,,,,,,,,
270251,,,,"Renia flavipunctalis","Yellow-spotted Renia Moth",Iowa,Johnson,2020-07-21,6:20:39,"MacBride Nature Recreation Area",41.78672811,-91.56848566,"Mark Brown",adult,Sighting,Photograph,1,,,,,,,,,
270321,,,,"Renia flavipunctalis","Yellow-spotted Renia Moth",Iowa,Linn,2020-07-20,22:54:20,"Hitaga Sand Ridge Prairie Preserve",42.25088607,-91.63206998,"Jim Durbin",adult,Blacklight/Fluorescent,Photograph,1,71,75,63,3,110,29.61,clear,new,
270324,,,,"Renia flavipunctalis","Yellow-spotted Renia Moth",Iowa,Linn,2020-07-20,22:15:46,"Hitaga Sand Ridge Prairie Preserve",42.25088607,-91.63206998,"Jim Durbin",adult,Blacklight/Fluorescent,Photograph,1,71,75,63,3,110,29.61,clear,new,
272821,"Paul Martsching Collection",2020-000397,,"Renia flavipunctalis","Yellow-spotted Renia Moth",Iowa,Story,2020-07-08,,"Ames, Paul",42.016779,-93.616948,"Paul Martsching",adult,"Building Light",Pinned,1,,,,,,,,,
272889,"Paul Martsching Collection",2020-000464,,"Renia flavipunctalis","Yellow-spotted Renia Moth",Iowa,Story,2020-07-20,,"Ames, Paul",42.016779,-93.616948,"Paul Martsching",adult,"Building Light",Pinned,1,,,,,,,,,
272890,"Paul Martsching Collection",2020-000465,,"Renia flavipunctalis","Yellow-spotted Renia Moth",Iowa,Story,2020-07-08,,"Ames, Paul",42.016779,-93.616948,"Paul Martsching",adult,"Building Light",Pinned,1,,,,,,,,,
290765,,,,"Renia flavipunctalis","Yellow-spotted Renia Moth",Iowa,Linn,2021-07-15,22:14:33,"Matsell Bridge Natural Area",42.13220412,-91.38527708,"Jim Durbin",adult,Blacklight/Fluorescent,Photograph,1,70,94,68,3,0,29.99,clear,"40% visible",
297896,,,,"Renia flavipunctalis","Yellow-spotted Renia Moth",Iowa,Johnson,2021-07-05,,"Ciha Fen Wildlife Preserve",41.829625,-91.382358,"Mark Brown",adult,Sighting,Photograph,1,,,,,,,,,
297918,,,,"Renia flavipunctalis","Yellow-spotted Renia Moth",Iowa,Webster,2021-07-11,,"Dolliver Memorial State Park",42.384689,-94.085501,"Mark Brown",adult,Sighting,Photograph,1,,,,,,,,,
297994,,,,"Renia flavipunctalis","Yellow-spotted Renia Moth",Iowa,Linn,2021-07-24,,"Hitaga Sand Ridge Prairie Preserve",42.250856,-91.633802,"Mark Brown",adult,Sighting,Photograph,1,,,,,,,,,
308871,"Jim Durbin Drawer 115",2022-000143,,"Renia flavipunctalis","Yellow-spotted Renia Moth",Iowa,Linn,2001-07-14,,"Wickiup Hill Outdoor Learning Area",42.084015,-91.764838,"Frank Olsen",adult,Blacklighting,Pinned,1,,,,,,,,,
312709,,,,"Renia flavipunctalis","Yellow-spotted Renia Moth",Iowa,Linn,2022-07-26,21:22:48,"Hitaga Sand Ridge Prairie Preserve",42.25103779,-91.63215575,"Jim Durbin",adult,Blacklight/Fluorescent,Photograph,1,76,79,69,1,170,29.91,cloudy,"10% moon",
312719,,,,"Renia flavipunctalis","Yellow-spotted Renia Moth",Iowa,Linn,2022-07-26,21:15:05,"Hitaga Sand Ridge Prairie Preserve",42.25103779,-91.63215575,"Jim Durbin",adult,Blacklight/Fluorescent,Photograph,1,76,79,69,1,170,29.91,cloudy,"10% moon",
313729,,,,"Renia flavipunctalis","Yellow-spotted Renia Moth",Iowa,Linn,2022-08-25,22:23:33,"Hitaga Sand Ridge Prairie Preserve",42.25103416,-91.63218888,"Jim Durbin",adult,Blacklight/Fluorescent,Photograph,1,73,90,70,2,350,30.03,clear,"10% visible",
313864,,,,"Renia flavipunctalis","Yellow-spotted Renia Moth",Iowa,Linn,2022-08-25,21:18:13,"Hitaga Sand Ridge Prairie Preserve",42.25103416,-91.63218888,"Jim Durbin",adult,Blacklight/Fluorescent,Photograph,1,73,90,70,2,350,30.03,clear,"10% visible",
318770,,,,"Renia flavipunctalis","Yellow-spotted Renia Moth",Iowa,Allamakee,2022-07-09,10:05:15,"Effigy Mounds National Monument",43.08714548,-91.18768147,"Mark Brown",adult,Sighting,Photograph,1,,,,,,,,,
320189,,,,"Renia flavipunctalis","Yellow-spotted Renia Moth",Iowa,Johnson,2022-07-10,6:17:37,"MacBride Nature Recreation Area",41.78687225,-91.56846254,"Mark Brown",adult,Sighting,Photograph,1,,,,,,,,,
337905,,,,"Renia flavipunctalis","Yellow-spotted Renia Moth",Iowa,Linn,2023-07-16,22:35:26,"Matsell Bridge Natural Area",42.13217249,-91.38522877,"Jim Durbin",adult,Blacklight/Fluorescent,Photograph,1,73,70,63,4,220,29.87,cloudy,"10% visible",
339764,,,,"Renia flavipunctalis","Yellow-spotted Renia Moth",Iowa,Muscatine,2023-08-17,21:16:04,"Big Sand Mound Prairie Preserve, Muscatine County",41.34031372,-91.0810559,"Jim Durbin",adult,Blacklight/Fluorescent,Photograph,1,69,66,57,0,0,29.93,clear,"new moon",
339804,,,,"Renia flavipunctalis","Yellow-spotted Renia Moth",Iowa,Muscatine,2023-08-17,21:35:31,"Big Sand Mound Prairie Preserve, Muscatine County",41.34031372,-91.0810559,"Jim Durbin",adult,Blacklight/Fluorescent,Photograph,1,69,66,57,0,0,29.93,clear,"new moon",
339894,,,,"Renia flavipunctalis","Yellow-spotted Renia Moth",Iowa,Muscatine,2023-08-17,22:27:12,"Big Sand Mound Prairie Preserve, Muscatine County",41.34031372,-91.0810559,"Jim Durbin",adult,Blacklight/Fluorescent,Photograph,1,69,66,57,0,0,29.93,clear,"new moon",
339941,,,,"Renia flavipunctalis","Yellow-spotted Renia Moth",Iowa,Muscatine,2023-08-17,22:53:03,"Big Sand Mound Prairie Preserve, Muscatine County",41.34031372,-91.0810559,"Jim Durbin",adult,Blacklight/Fluorescent,Photograph,1,69,66,57,0,0,29.93,clear,"new moon",
341239,,,,"Renia flavipunctalis","Yellow-spotted Renia Moth",Iowa,Muscatine,2023-09-12,20:46:57,"Big Sand Mound Prairie Preserve, Muscatine County",41.34023049,-91.08094105,"Jim Durbin",adult,Blacklight/Fluorescent,Photograph,1,,,,,,,,,
