ID,"Collection / Source","Catalog Number","Specify Number",Taxon,"Common Name",State,County,Date,Time,Locale,Latitude,Longitude,Collector,"Life Stage","Collection Method","Preparation Type",Count,Temperature,Humidity,"Dew Point",Wind,"Wind Direction","Barometric Pressure",Sky,"Moon Phase",Notes
18484,,2014-018807,SPM002703,"Caloptilia violacella",None,Iowa,Jasper,2003-05-15,,"Neal Smith National Wildlife Refuge",41.5678,-93.2675,"Keith Summerville",adult,,Pinned,1,,,,,,,,,
18485,,2014-018808,SPM007922,"Caloptilia violacella",None,Iowa,Jasper,2006-05-25,,"Neal Smith National Wildlife Refuge",41.54245,-93.2908,"Keith Summerville",adult,,Pinned,1,,,,,,,,,
18486,,2014-018809,SPM019658,"Caloptilia violacella",None,Iowa,Muscatine,2010-06-07,,"Kautz Fen",41.4685,-91.053,"Ryan Rasmussen",adult,,Photograph,1,,,,,,,,,
18487,,2014-018810,SPM019792,"Caloptilia violacella",None,Iowa,Johnson,2010-07-20,,"Iowa City Site 1",41.62806,-91.51417,"Mark Brown",adult,,Photograph,1,,,,,,,,,
18488,,2014-018811,SPM020681,"Caloptilia violacella",None,Iowa,Jasper,2003-08-13,,"Neal Smith National Wildlife Refuge",41.53665,-93.26337,"Keith Summerville",adult,,Pinned,1,,,,,,,,,
18489,,2014-018812,SPM030807,"Caloptilia violacella",None,Iowa,Linn,2012-07-22,,"Wakpicada Natural Area",42.18892,-91.52035,"Jim Durbin",adult,Blacklight/Fluorescent,Photograph,1,,,,,,,,,
18490,,2014-018813,SPM031085,"Caloptilia violacella",None,Iowa,Linn,2012-07-29,,"Matsell Bridge Natural Area",42.13131,-91.38886,"Jim Durbin",adult,Blacklight/Fluorescent,Photograph,1,,,,,,,,,
18491,,2014-018814,SPM031532,"Caloptilia violacella",None,Iowa,Kossuth,2012-08-07,,"Ambrose A. Call State Park",43.0517,-94.2498,"Matt Kenne",adult,,Sighting,1,,,,,,,,,
69464,,2014-070071,,"Caloptilia violacella",None,Iowa,Polk,2005-05-25,,"Big Creek State Park",41.81167,-93.75333,"Keith Summerville",adult,,Sighting,3,,,,,,,,,
69465,,2014-070072,,"Caloptilia violacella",None,Iowa,Jasper,2006-05-25,,"Neal Smith National Wildlife Refuge",41.54245,-93.2908,"Keith Summerville",adult,,Sighting,1,,,,,,,,,
129065,,2015-019655,,"Caloptilia violacella",None,Iowa,Scott,2015-07-18,,Walcott,41.59151,-90.781632,"Moni Hayne",adult,Blacklight/Fluorescent,Photograph,1,,,,,,,,,
148116,,2016-012743,,"Caloptilia violacella",None,Iowa,Winneshiek,2015-09-05,,"Plymouth Rock-x",0,0,"MJ Hatfield",adult,,Photograph,1,,,,,,,,,
172216,,2016-036961,,"Caloptilia violacella",None,Iowa,Linn,2016-07-20,2100-2330,"Hitaga Sand Ridge Prairie Preserve",42.250957,-91.632098,"Jim Durbin",adult,Blacklight/Fluorescent,Photograph,1,81,90,77,5,180,30.01,cloudy,full,
172349,,2016-037094,,"Caloptilia violacella",None,Iowa,Linn,2016-07-20,2100-2330,"Hitaga Sand Ridge Prairie Preserve",42.250957,-91.632098,"Jim Durbin",adult,Blacklight/Fluorescent,Photograph,1,81,90,77,5,180,30.01,cloudy,full,
176364,,2016-041114,,"Caloptilia violacella",None,Iowa,Linn,2016-09-11,2000-2200,"Hitaga Sand Ridge Prairie Preserve",42.250957,-91.632098,"Jim Durbin",adult,Blacklight/Fluorescent,Photograph,1,76,40,50,5,120,29.99,clear,"80% visible",
181779,,2016-046463,,"Caloptilia violacella",None,Iowa,Johnson,2016-05-26,,Redacted,Redacted,Redacted,"Mark Brown",adult,,Photograph,1,,,,,,,,,
181858,,2016-046598,,"Caloptilia violacella",None,Iowa,Johnson,2016-08-01,,Redacted,Redacted,Redacted,"Mark Brown",adult,,Photograph,1,,,,,,,,,
196280,,2017-014218,,"Caloptilia violacella",None,Iowa,Howard,2015-07-15,,"Hayden Prairie State Wildlife Management Area",43.4394444,-92.3802778,"Charley Eiseman",adult,,Sighting,1,,,,,,,,,
216324,,2018-014480,,"Caloptilia violacella",None,Iowa,Marshall,2018-07-26,,"Grimes Farm and Conservation Center",42.0228,-92.972371,"Jim Durbin",adult,Blacklight/Fluorescent,Photograph,1,,,,,,,,,
216345,,2018-014501,,"Caloptilia violacella",None,Iowa,Marshall,2018-07-26,,"Grimes Farm and Conservation Center",42.0228,-92.972371,"Jim Durbin",adult,Blacklight/Fluorescent,Photograph,1,,,,,,,,,
216346,,2018-014502,,"Caloptilia violacella",None,Iowa,Marshall,2018-07-26,,"Grimes Farm and Conservation Center",42.0228,-92.972371,"Jim Durbin",adult,Blacklight/Fluorescent,Photograph,1,,,,,,,,,
216361,,2018-014517,,"Caloptilia violacella",None,Iowa,Marshall,2018-07-26,,"Grimes Farm and Conservation Center",42.0228,-92.972371,"Jim Durbin",adult,Blacklight/Fluorescent,Photograph,1,,,,,,,,,
217650,,2018-015806,,"Caloptilia violacella",None,Iowa,Winneshiek,2018-07-08,,"100 Acre Wood-x",0,0,"MJ Hatfield",adult,"Blacklight Trap",Photograph,1,,,,,,,,,
218314,,2018-016470,,"Caloptilia violacella",None,Iowa,Linn,2018-08-08,2045-2315,"Hitaga Sand Ridge Prairie Preserve",42.250957,-91.632098,"Jim Durbin",adult,Blacklight/Fluorescent,Photograph,1,73,83,68,6,210,29.93,clear,"10 % visible",
219357,,2018-017513,,"Caloptilia violacella",None,Iowa,Linn,2018-08-25,2015-2300,"Hitaga Sand Ridge Prairie Preserve",42.250604,-91.629962,"Jim Durbin",adult,Blacklight/Fluorescent,Photograph,1,74,97,73,3,310,29.91,cdlear,"Full Moon",
219367,,2018-017523,,"Caloptilia violacella",None,Iowa,Linn,2018-08-25,2015-2300,"Hitaga Sand Ridge Prairie Preserve",42.250604,-91.629962,"Jim Durbin",adult,Blacklight/Fluorescent,Photograph,1,74,97,73,3,310,29.91,cdlear,"Full Moon",
222199,,2018-020353,,"Caloptilia violacella",None,Iowa,Jefferson,2018-07-25,,"Jefferson County Park",40.98639,-91.99111,"MJ Hatfield",adult,,Photograph,1,,,,,,,,,
222272,,2018-020426,,"Caloptilia violacella",None,Iowa,Allamakee,2018-09-21,,Redacted,Redacted,Redacted,"MJ Hatfield",adult,,Photograph,1,,,,,,,,,
232675,,2019-007388,,"Caloptilia violacella",None,Iowa,Linn,2019-06-26,"50% visible","Hitaga Sand Ridge Prairie Preserve",42.250957,-91.632098,"Jim Durbin",adult,Blacklight/Fluorescent,Photograph,1,79,69,68,1,100,29.79,clear,,
268195,,,,"Caloptilia violacella",None,Iowa,Linn,2020-06-30,22:46:26,"Hitaga Sand Ridge Prairie Preserve",42.25088735,-91.63212362,"Jim Durbin",adult,Blacklight/Fluorescent,Photograph,1,78,88,74,2,100,29.85,cloudy,"80% visible",
269857,,,,"Caloptilia violacella",None,Iowa,Linn,2020-08-08,21:53:44,"Hitaga Sand Ridge Prairie Preserve",42.25088607,-91.63213435,"Jim Durbin",adult,Blacklight/Fluorescent,Photograph,1,78,81,71,7,180,30.02,clear,"80% visible",
269896,,,,"Caloptilia violacella",None,Iowa,Linn,2020-08-08,21:42:20,"Hitaga Sand Ridge Prairie Preserve",42.25088607,-91.63213435,"Jim Durbin",adult,Blacklight/Fluorescent,Photograph,1,78,81,71,7,180,30.02,clear,"80% visible",
269897,,,,"Caloptilia violacella",None,Iowa,Linn,2020-08-08,21:42:20,"Hitaga Sand Ridge Prairie Preserve",42.25088607,-91.63213435,"Jim Durbin",adult,Blacklight/Fluorescent,Photograph,1,78,81,71,7,180,30.02,clear,"80% visible",
269948,,,,"Caloptilia violacella",None,Iowa,Linn,2020-08-08,21:16:07,"Hitaga Sand Ridge Prairie Preserve",42.25088607,-91.63213435,"Jim Durbin",adult,Blacklight/Fluorescent,Photograph,1,78,81,71,7,180,30.02,clear,"80% visible",
269950,,,,"Caloptilia violacella",None,Iowa,Linn,2020-08-08,21:16:04,"Hitaga Sand Ridge Prairie Preserve",42.25088607,-91.63213435,"Jim Durbin",adult,Blacklight/Fluorescent,Photograph,1,78,81,71,7,180,30.02,clear,"80% visible",
269966,,,,"Caloptilia violacella",None,Iowa,Linn,2020-08-08,21:13:00,"Hitaga Sand Ridge Prairie Preserve",42.25088607,-91.63213435,"Jim Durbin",adult,Blacklight/Fluorescent,Photograph,1,78,81,71,7,180,30.02,clear,"80% visible",
269970,,,,"Caloptilia violacella",None,Iowa,Linn,2020-08-08,21:11:33,"Hitaga Sand Ridge Prairie Preserve",42.25088607,-91.63213435,"Jim Durbin",adult,Blacklight/Fluorescent,Photograph,1,78,81,71,7,180,30.02,clear,"80% visible",
269994,,,,"Caloptilia violacella",None,Iowa,Linn,2020-08-08,21:06:33,"Hitaga Sand Ridge Prairie Preserve",42.25088607,-91.63213435,"Jim Durbin",adult,Blacklight/Fluorescent,Photograph,1,78,81,71,7,180,30.02,clear,"80% visible",
269995,,,,"Caloptilia violacella",None,Iowa,Linn,2020-08-08,21:06:07,"Hitaga Sand Ridge Prairie Preserve",42.25088607,-91.63213435,"Jim Durbin",adult,Blacklight/Fluorescent,Photograph,1,78,81,71,7,180,30.02,clear,"80% visible",
269996,,,,"Caloptilia violacella",None,Iowa,Linn,2020-08-08,21:05:39,"Hitaga Sand Ridge Prairie Preserve",42.25088607,-91.63213435,"Jim Durbin",adult,Blacklight/Fluorescent,Photograph,1,78,81,71,7,180,30.02,clear,"80% visible",
270000,,,,"Caloptilia violacella",None,Iowa,Linn,2020-08-08,21:05:22,"Hitaga Sand Ridge Prairie Preserve",42.25088607,-91.63213435,"Jim Durbin",adult,Blacklight/Fluorescent,Photograph,1,78,81,71,7,180,30.02,clear,"80% visible",
270001,,,,"Caloptilia violacella",None,Iowa,Linn,2020-08-08,21:05:37,"Hitaga Sand Ridge Prairie Preserve",42.25088607,-91.63213435,"Jim Durbin",adult,Blacklight/Fluorescent,Photograph,1,78,81,71,7,180,30.02,clear,"80% visible",
290282,,,,"Caloptilia violacella",None,Iowa,Linn,2021-07-08,22:57:28,"Hitaga Sand Ridge Prairie Preserve",42.25145774,-91.63021403,"Jim Durbin",adult,Blacklight/Fluorescent,Photograph,1,69,73,60,5,90,29.89,"partly cloudy","5% visible",
290333,,,,"Caloptilia violacella",None,Iowa,Linn,2021-07-08,22:37:44,"Hitaga Sand Ridge Prairie Preserve",42.25145774,-91.63021403,"Jim Durbin",adult,Blacklight/Fluorescent,Photograph,1,69,73,60,5,90,29.89,"partly cloudy","5% visible",
290357,,,,"Caloptilia violacella",None,Iowa,Linn,2021-07-08,22:33:32,"Hitaga Sand Ridge Prairie Preserve",42.25145774,-91.63021403,"Jim Durbin",adult,Blacklight/Fluorescent,Photograph,1,69,73,60,5,90,29.89,"partly cloudy","5% visible",
290628,,,,"Caloptilia violacella",None,Iowa,Linn,2021-07-08,21:45:21,"Hitaga Sand Ridge Prairie Preserve",42.25145774,-91.63021403,"Jim Durbin",adult,Blacklight/Fluorescent,Photograph,1,69,73,60,5,90,29.89,"partly cloudy","5% visible",
291346,,,,"Caloptilia violacella",None,Iowa,Linn,2021-08-06,21:32:00,"Hitaga Sand Ridge Prairie Preserve",42.25082292,-91.63215158,"Jim Durbin",adult,Blacklight/Fluorescent,Photograph,1,78,72,68,4,165,29.79,cloudy,"new moon",
291355,,,,"Caloptilia violacella",None,Iowa,Linn,2021-08-06,21:29:26,"Hitaga Sand Ridge Prairie Preserve",42.25082292,-91.63215158,"Jim Durbin",adult,Blacklight/Fluorescent,Photograph,1,78,72,68,4,165,29.79,cloudy,"new moon",
291363,,,,"Caloptilia violacella",None,Iowa,Linn,2021-08-06,21:27:39,"Hitaga Sand Ridge Prairie Preserve",42.25082292,-91.63215158,"Jim Durbin",adult,Blacklight/Fluorescent,Photograph,1,78,72,68,4,165,29.79,cloudy,"new moon",
291402,,,,"Caloptilia violacella",None,Iowa,Linn,2021-08-06,21:13:34,"Hitaga Sand Ridge Prairie Preserve",42.25082292,-91.63215158,"Jim Durbin",adult,Blacklight/Fluorescent,Photograph,1,78,72,68,4,165,29.79,cloudy,"new moon",
291403,,,,"Caloptilia violacella",None,Iowa,Linn,2021-08-06,21:13:22,"Hitaga Sand Ridge Prairie Preserve",42.25082292,-91.63215158,"Jim Durbin",adult,Blacklight/Fluorescent,Photograph,1,78,72,68,4,165,29.79,cloudy,"new moon",
291409,,,,"Caloptilia violacella",None,Iowa,Linn,2021-08-06,21:12:16,"Hitaga Sand Ridge Prairie Preserve",42.25082292,-91.63215158,"Jim Durbin",adult,Blacklight/Fluorescent,Photograph,1,78,72,68,4,165,29.79,cloudy,"new moon",
291418,,,,"Caloptilia violacella",None,Iowa,Linn,2021-08-06,21:10:00,"Hitaga Sand Ridge Prairie Preserve",42.25082292,-91.63215158,"Jim Durbin",adult,Blacklight/Fluorescent,Photograph,1,78,72,68,4,165,29.79,cloudy,"new moon",
291421,,,,"Caloptilia violacella",None,Iowa,Linn,2021-08-06,21:09:20,"Hitaga Sand Ridge Prairie Preserve",42.25082292,-91.63215158,"Jim Durbin",adult,Blacklight/Fluorescent,Photograph,1,78,72,68,4,165,29.79,cloudy,"new moon",
291429,,,,"Caloptilia violacella",None,Iowa,Linn,2021-08-06,21:07:21,"Hitaga Sand Ridge Prairie Preserve",42.25082292,-91.63215158,"Jim Durbin",adult,Blacklight/Fluorescent,Photograph,1,78,72,68,4,165,29.79,cloudy,"new moon",
292023,,,,"Caloptilia violacella",None,Iowa,Linn,2021-08-15,21:35:23,"Pinicon Ridge Park",42.21087488,-91.54432767,"Jim Durbin",adult,Blacklight/Fluorescent,Photograph,1,72,46,50,3,90,29.96,clear,"50% visible",
292069,,,,"Caloptilia violacella",None,Iowa,Linn,2021-08-15,21:13:54,"Pinicon Ridge Park",42.21087488,-91.54432767,"Jim Durbin",adult,Blacklight/Fluorescent,Photograph,1,72,46,50,3,90,29.96,clear,"50% visible",
292103,,,,"Caloptilia violacella",None,Iowa,Linn,2021-08-15,20:42:59,"Pinicon Ridge Park",42.21087488,-91.54432767,"Jim Durbin",adult,Blacklight/Fluorescent,Photograph,1,72,46,50,3,90,29.96,clear,"50% visible",
313063,,,,"Caloptilia violacella",None,Iowa,Linn,2022-08-10,22:24:23,"Matsell Bridge Natural Area",42.13198835,-91.38532446,"Jim Durbin",adult,Blacklight/Fluorescent,Photograph,1,68,100,69,0,0,30.15,clear,full,
313242,,,,"Caloptilia violacella",None,Iowa,Lee,2022-08-12,21:15:16,"Shimek State Forest, Donnellson Unit",40.648392,-91.681322,"Angella Moorehouse",adult,Blacklight/Fluorescent,Photograph,1,,,,,,,,,
313538,,,,"Caloptilia violacella",None,Iowa,Linn,2022-08-17,22:27:02,"Wanatee County Park",42.01012074,-91.56658753,"Jim Durbin",adult,Blacklight/Fluorescent,Photograph,1,68,91,65,0,0,30.08,clear,"80% visible",
313553,,,,"Caloptilia violacella",None,Iowa,Linn,2022-08-17,22:21:41,"Wanatee County Park",42.01012074,-91.56658753,"Jim Durbin",adult,Blacklight/Fluorescent,Photograph,1,68,91,65,0,0,30.08,clear,"80% visible",
314491,,,,"Caloptilia violacella",None,Iowa,Linn,2022-09-05,21:06:32,"Pinicon Ridge Park",42.21852221,-91.53890027,"Jim Durbin",adult,Blacklight/Fluorescent,Photograph,1,72,87,68,2,90,30.07,cloudy,"50% visible",
332130,,,,"Caloptilia violacella",None,Iowa,Johnson,2022-08-26,22:32:55,Redacted,Redacted,Redacted,"Mark Brown",adult,Sighting,Photograph,1,,,,,,,,,
332152,,,,"Caloptilia violacella",None,Iowa,Johnson,2022-08-25,23:06:56,Redacted,Redacted,Redacted,"Mark Brown",adult,Sighting,Photograph,1,,,,,,,,,
332333,,,,"Caloptilia violacella",None,Iowa,Johnson,2022-08-11,21:48:05,Redacted,Redacted,Redacted,"Mark Brown",adult,Sighting,Photograph,1,,,,,,,,,
334478,,,,"Caloptilia violacella",None,Iowa,Linn,2023-05-15,20:57:56,"Wanatee County Park",42.01004004666667,-91.56646889666666,"Jim Durbin",adult,Blacklight/Fluorescent,Photograph,1,,,,0,,,,,
335159,,,,"Caloptilia violacella",None,Iowa,Linn,2023-06-17,21:47:36,"Wanatee County Park",42.010114365,-91.566550498333,"Jim Durbin",adult,Blacklight/Fluorescent,Photograph,1,75,54,57,2,90,29.84,c;ear,"no moon",
338141,,,,"Caloptilia violacella",None,Iowa,Muscatine,2023-07-18,22:52:56,"Big Sand Mound Prairie Preserve, Muscatine County",41.34026787,-91.08103262,"Jim Durbin",adult,Blacklight/Fluorescent,Photograph,1,72,70,62,0,90,29.99,"partly cloudy","new moon",
339810,,,,"Caloptilia violacella",None,Iowa,Muscatine,2023-08-17,21:36:35,"Big Sand Mound Prairie Preserve, Muscatine County",41.34031372,-91.0810559,"Jim Durbin",adult,Blacklight/Fluorescent,Photograph,1,69,66,57,0,0,29.93,clear,"new moon",
339835,,,,"Caloptilia violacella",None,Iowa,Muscatine,2023-08-17,21:50:09,"Big Sand Mound Prairie Preserve, Muscatine County",41.34031372,-91.0810559,"Jim Durbin",adult,Blacklight/Fluorescent,Photograph,1,69,66,57,0,0,29.93,clear,"new moon",
340940,,,,"Caloptilia violacella",None,Iowa,Linn,2023-08-25,21:41:44,"Hitaga Sand Ridge Prairie Preserve",42.25093191,-91.63218534,"Jim Durbin",adult,Blacklight/Fluorescent,Photograph,1,81,72,71,5,345,29.93,clear,"60% visible",
341015,,,,"Caloptilia violacella",None,Iowa,Linn,2023-08-25,22:38:53,"Hitaga Sand Ridge Prairie Preserve",42.25093191,-91.63218534,"Jim Durbin",adult,Blacklight/Fluorescent,Photograph,1,81,72,71,5,345,29.93,clear,"60% visible",
368073,,,,"Caloptilia violacella",None,Iowa,Linn,2024-06-25,22:08:57,"Matsell Bridge Natural Area",42.132206666667,-91.385322201667,"Jim Durbin",adult,Blacklight/Fluorescent,Photograph,1,,,,,,,,,
368314,,,,"Caloptilia violacella",None,Iowa,Linn,2024-07-03,21:53:31,"Palisades Kepler State Park",41.908460893333,-91.502337645,"Jim Durbin",adult,Blacklight/Fluorescent,Photograph,1,81,58,64,3,235,29.91,"partly cloudy","10% visible",
