ID,"Collection / Source","Catalog Number","Specify Number",Taxon,"Common Name",State,County,Date,Time,Locale,Latitude,Longitude,Collector,"Life Stage","Collection Method","Preparation Type",Count,Temperature,Humidity,"Dew Point",Wind,"Wind Direction","Barometric Pressure",Sky,"Moon Phase",Notes
10695,,2014-010977,,"Metalectra quadrisignata","Four-spotted Fungus Moth",Iowa,Linn,2014-08-08,2030-2300DST,"Pleasant Creek State Recreation Area, Linn County",42.110327,-91.822988,"Jim Durbin",adult,Blacklight/Fluorescent,Photograph,1,72-69,79,62,Calm,,30.04,Clear,,
12118,,2014-012400,SPM042169,"Metalectra quadrisignata","Four-spotted Fungus Moth",Kentucky,Ohio,2014-07-02,,Redacted,Redacted,Redacted,"Jim Durbin",adult,Blacklight/Fluorescent,Photograph,1,,,,,,,,,
36438,,2014-036812,SPM037962,"Metalectra quadrisignata","Four-spotted Fungus Moth",Iowa,Jefferson,2009-08-15,,"Near Fairfield",41.0503,-92.024,"Moni Hayne",adult,Blacklight/Fluorescent,Photograph,1,,,,,,,,,
36443,,2014-036817,SPM003704,"Metalectra quadrisignata","Four-spotted Fungus Moth",Iowa,Jasper,2003-05-15,,"Neal Smith National Wildlife Refuge",41.5678,-93.2675,"Keith Summerville",adult,,Pinned,1,,,,,,,,,
36444,"Jim Durbin Drawer 120",2014-036818,SPM007112,"Metalectra quadrisignata","Four-spotted Fungus Moth",Kentucky,Ohio,2006-08-15,,"Leon's Farm, Ohio County",37.42033,-86.77023,"Jim Durbin",adult,Blacklight/Fluorescent,Pinned,1,,,,,,,,,
36446,"Frank Olsen Drawer 41",2014-036820,SPM013138,"Metalectra quadrisignata","Four-spotted Fungus Moth",Iowa,Linn,2008-09-26,,"Hanging Bog State Preserve",42.0333365,-91.767999,"Frank Olsen",adult,,Pinned,1,,,,,,,,,"Located at Iowa State"
36447,"Frank Olsen Drawer 41",2014-036821,SPM013139,"Metalectra quadrisignata","Four-spotted Fungus Moth",Iowa,Linn,2008-09-19,,"Pleasant Creek State Recreation Area, Linn County",42.11952,-91.81215,"Frank Olsen",adult,,Pinned,1,,,,,,,,,"Located at Iowa State"
36449,,2014-036823,SPM029809,"Metalectra quadrisignata","Four-spotted Fungus Moth",Iowa,Jones,2012-07-01,,"Wapsipinicon State Park",42.09038,-91.2861,"Jim Durbin",adult,Blacklight/Fluorescent,Photograph,1,,,,,,,,,
36450,,2014-036824,SPM029829,"Metalectra quadrisignata","Four-spotted Fungus Moth",Iowa,Jones,2012-07-01,,"Wapsipinicon State Park",42.09038,-91.2861,"Jim Durbin",adult,Blacklight/Fluorescent,Photograph,1,,,,,,,,,
36451,"Frank Olsen Drawer 41",2014-036825,SPM032033,"Metalectra quadrisignata","Four-spotted Fungus Moth",Iowa,Clarke,2012-05-27,,"Red Fern Timber",40.98317,-93.75317,"Frank Olsen",adult,,Pinned,1,,,,,,,,,"Located at Iowa State"
36452,,2014-036826,SPM037858,"Metalectra quadrisignata","Four-spotted Fungus Moth",Iowa,Jefferson,2009-08-11,,"Near Fairfield",41.0503,-92.024,"Moni Hayne",adult,Blacklight/Fluorescent,Photograph,1,,,,,,,,,
36453,,2014-036827,SPM037859,"Metalectra quadrisignata","Four-spotted Fungus Moth",Iowa,Jefferson,2009-08-11,,"Near Fairfield",41.0503,-92.024,"Moni Hayne",adult,Blacklight/Fluorescent,Photograph,1,,,,,,,,,
36454,"Jim Durbin Drawer 120",2014-036828,SPM040283,"Metalectra quadrisignata","Four-spotted Fungus Moth",Iowa,Linn,2014-06-10,,"Pleasant Creek State Recreation Area, Linn County",42.10948,-91.8249,"Jim Durbin",adult,Blacklight/Fluorescent,Pinned,1,,,,,,,,,
36455,"Jim Durbin Drawer 120",2014-036829,SPM040287,"Metalectra quadrisignata","Four-spotted Fungus Moth",Iowa,Linn,2014-06-10,,"Pleasant Creek State Recreation Area, Linn County",42.10948,-91.8249,"Jim Durbin",adult,Blacklight/Fluorescent,Pinned,1,,,,,,,,,
50039,"Jim Durbin Drawer 120",2014-050421,,"Metalectra quadrisignata","Four-spotted Fungus Moth",Iowa,Linn,2014-08-18,2030-2300DST,"Wanatee County Park",42.01007,-91.566739,"Jim Durbin",adult,Blacklight/Fluorescent,Pinned,1,77-74,75-86,68,,,29.73,Clear,,
108102,"Frank Olsen Drawer 59",2014-108849,,"Metalectra quadrisignata","Four-spotted Fungus Moth",Iowa,Clarke,2014-09-26,,"Red Fern Timber",40.98317,-93.75317,"Frank Olsen",adult,,Pinned,1,,,,,,,,,"Located at Iowa State"
127573,,2015-018163,,"Metalectra quadrisignata","Four-spotted Fungus Moth",Iowa,Linn,2015-06-23,,"Matsell Bridge Natural Area",42.131959,-91.388307,"Jim Durbin",adult,Blacklight/Fluorescent,Photograph,1,,,,,,,,,
128041,,2015-018631,,"Metalectra quadrisignata","Four-spotted Fungus Moth",Iowa,Jackson,2015-07-10,2100-2330,"Prairie Creek Recreation Area",42.061696,-90.638097,"Jim Durbin",adult,Blacklight/Fluorescent,Photograph,1,75,80,60,6,120,30.14,clear,"20% visible",
129376,"Jim Durbin Drawer 120",2015-019966,,"Metalectra quadrisignata","Four-spotted Fungus Moth",Iowa,Linn,2015-08-21,2030-2230,"Indian Creek Nature Center",41.968932,-91.586884,"Jim Durbin",adult,Blacklight/Fluorescent,Pinned,1,73,61,58,4,160,29.95,clear,"30% visible",
129933,,2015-020523,,"Metalectra quadrisignata","Four-spotted Fungus Moth",Iowa,Linn,2015-09-01,"2000 - 2230","Indian Creek Nature Center",41.968932,-91.586884,"Jim Durbin",adult,Blacklight/Fluorescent,Photograph,1,81,71,71,2,180,29.96,cloudy,"95% visible",
129937,,2015-020527,,"Metalectra quadrisignata","Four-spotted Fungus Moth",Iowa,Linn,2015-09-01,"2000 - 2230","Indian Creek Nature Center",41.968932,-91.586884,"Jim Durbin",adult,Blacklight/Fluorescent,Photograph,1,81,71,71,2,180,29.96,cloudy,"95% visible",
129950,,2015-020540,,"Metalectra quadrisignata","Four-spotted Fungus Moth",Iowa,Linn,2015-09-01,"2000 - 2230","Indian Creek Nature Center",41.968932,-91.586884,"Jim Durbin",adult,Blacklight/Fluorescent,Photograph,1,81,71,71,2,180,29.96,cloudy,"95% visible",
130123,,2015-020713,,"Metalectra quadrisignata","Four-spotted Fungus Moth",Iowa,Linn,2015-09-03,,"Matsell Bridge Natural Area",42.131959,-91.388307,"Jim Durbin",adult,Blacklight/Fluorescent,Photograph,1,79,91,75,0,0,29.87,"partly cloudy","70% visible",
130132,,2015-020722,,"Metalectra quadrisignata","Four-spotted Fungus Moth",Iowa,Linn,2015-09-03,,"Matsell Bridge Natural Area",42.131959,-91.388307,"Jim Durbin",adult,Blacklight/Fluorescent,Photograph,1,79,91,75,0,0,29.87,"partly cloudy","70% visible",
130402,,2015-020992,,"Metalectra quadrisignata","Four-spotted Fungus Moth",Iowa,Linn,2015-09-07,"1950 - 2230","Wanatee County Park",42.01026,-91.57381,"Jim Durbin",adult,Blacklight/Fluorescent,Photograph,1,79,79,72,1,120,29.91,"partly cloudy","40% visible",
132095,"Paul Martsching Collection",2015-022686,,"Metalectra quadrisignata","Four-spotted Fungus Moth",Iowa,Story,2015-06-18,,"Ames, Paul",42.02064,-93.623952,"Paul Martsching",adult,"Building Light",Pinned,1,,,,,,,,,
174584,,2016-039334,,"Metalectra quadrisignata","Four-spotted Fungus Moth",Iowa,Linn,2016-08-15,2030-2300,"Hitaga Sand Ridge Prairie Preserve",42.250957,-91.632098,"Jim Durbin",adult,Blacklight/Fluorescent,Photograph,1,75,74,66,0,0,29096,cloudy,full,
175140,,2016-039890,,"Metalectra quadrisignata","Four-spotted Fungus Moth",Iowa,Linn,2016-08-28,2000-2230,"Hitaga Sand Ridge Prairie Preserve",42.250957,-91.632098,"Jim Durbin",adult,Blacklight/Fluorescent,Photograph,1,74,83,74,9,110,30.1,cloudy,"10% visible","Rained for about 15 minutes at 8:00PM"
175186,,2016-039936,,"Metalectra quadrisignata","Four-spotted Fungus Moth",Iowa,Linn,2016-08-28,2000-2230,"Hitaga Sand Ridge Prairie Preserve",42.250957,-91.632098,"Jim Durbin",adult,Blacklight/Fluorescent,Photograph,1,74,83,74,9,110,30.1,cloudy,"10% visible","Rained for about 15 minutes at 8:00PM"
176019,,2016-040769,,"Metalectra quadrisignata","Four-spotted Fungus Moth",Iowa,Linn,2016-08-31,2000-2130,"Wanatee County Park",42.010091,-91.566619,"Jim Durbin",adult,Blacklight/Fluorescent,Photograph,1,69,63,56,1,45,30.07,clear,"dark moon",
182813,,2017-000774,,"Metalectra quadrisignata","Four-spotted Fungus Moth",Iowa,Winneshiek,2016-08-24,,"100 Acre Wood-x",0,0,"MJ Hatfield",adult,,Photograph,1,,,,,,,,,
218763,,2018-016919,,"Metalectra quadrisignata","Four-spotted Fungus Moth",Iowa,Linn,2018-08-16,2030-2330,"Matsell Bridge Natural Area",42.132148,-91.385221,"Jim Durbin",adult,Blacklight/Fluorescent,Photograph,1,72,83,66,5,310,29.84,"partly cloudy","30% visible",
218958,,2018-017114,,"Metalectra quadrisignata","Four-spotted Fungus Moth",Iowa,Linn,2018-08-16,2030-2330,"Matsell Bridge Natural Area",42.132148,-91.385221,"Jim Durbin",adult,Blacklight/Fluorescent,Photograph,1,72,83,66,5,310,29.84,"partly cloudy","30% visible",
233539,,2019-008251,,"Metalectra quadrisignata","Four-spotted Fungus Moth",Iowa,Linn,2019-07-07,2100-2315,"Hitaga Sand Ridge Prairie Preserve",42.250957,-91.632098,"Jim Durbin",adult,Blacklight/Fluorescent,Photograph,1,72,59,62,2,90,29.84,"parthly cloudy","10 % visible",
236821,,,,"Metalectra quadrisignata","Four-spotted Fungus Moth",Iowa,Linn,2019-09-02,,"Matsell Bridge Natural Area",42.131959,-91.388307,"Jim Durbin",adult,Blacklight/Fluorescent,Photograph,1,77,77,67,4,135,29.85,"parthly cloudy","10% visible",
237801,,,,"Metalectra quadrisignata","Four-spotted Fungus Moth",Iowa,Linn,2019-09-02,2000-2300,"Matsell Bridge Natural Area",42.131959,-91.388307,"Jim Durbin",adult,Blacklight/Fluorescent,Photograph,1,77,77,67,4,135,29.85,"parthly cloudy","10% visible",
237805,,,,"Metalectra quadrisignata","Four-spotted Fungus Moth",Iowa,Linn,2019-09-02,2000-2300,"Matsell Bridge Natural Area",42.131959,-91.388307,"Jim Durbin",adult,Blacklight/Fluorescent,Photograph,1,77,77,67,4,135,29.85,"parthly cloudy","10% visible",
237931,,,,"Metalectra quadrisignata","Four-spotted Fungus Moth",Iowa,Linn,2019-09-02,2000-2300,"Matsell Bridge Natural Area",42.131959,-91.388307,"Jim Durbin",adult,Blacklight/Fluorescent,Photograph,1,77,77,67,4,135,29.85,"parthly cloudy","10% visible",
265921,,,,"Metalectra quadrisignata","Four-spotted Fungus Moth",Iowa,Linn,2020-06-07,21:12:04,"Wickiup Hill Outdoor Learning Area",42.08736536,-91.76707659,"Jim Durbin",adult,Sighting,Photograph,1,81,49,60,4,170,29.77,clear,full,
267649,,,,"Metalectra quadrisignata","Four-spotted Fungus Moth",Iowa,Linn,2020-06-23,21:56:58,"Matsell Bridge Natural Area",42.13215952,-91.38525882,"Jim Durbin",adult,Blacklight/Fluorescent,Photograph,1,64,100,62,3,290,29.9,cloudy,"no moon",
267851,,,,"Metalectra quadrisignata","Four-spotted Fungus Moth",Iowa,Linn,2020-06-28,22:29:50,"Wickiup Hill Outdoor Learning Area",42.08735076,-91.76706884,"Jim Durbin",adult,Blacklight/Fluorescent,Photograph,1,78,76,70,4,110,29.57,clear,"50% visible",
268154,,,,"Metalectra quadrisignata","Four-spotted Fungus Moth",Iowa,Linn,2020-06-30,23:02:41,"Hitaga Sand Ridge Prairie Preserve",42.25088735,-91.63212362,"Jim Durbin",adult,Blacklight/Fluorescent,Photograph,1,78,88,74,2,100,29.85,cloudy,"80% visible",
268264,,,,"Metalectra quadrisignata","Four-spotted Fungus Moth",Iowa,Linn,2020-06-30,22:29:13,"Hitaga Sand Ridge Prairie Preserve",42.25088735,-91.63212362,"Jim Durbin",adult,Blacklight/Fluorescent,Photograph,1,78,88,74,2,100,29.85,cloudy,"80% visible",
268278,,,,"Metalectra quadrisignata","Four-spotted Fungus Moth",Iowa,Linn,2020-06-30,22:11:32,"Hitaga Sand Ridge Prairie Preserve",42.25088735,-91.63212362,"Jim Durbin",adult,Blacklight/Fluorescent,Photograph,1,78,88,74,2,100,29.85,cloudy,"80% visible",
268317,,,,"Metalectra quadrisignata","Four-spotted Fungus Moth",Iowa,Linn,2020-06-30,22:01:17,"Hitaga Sand Ridge Prairie Preserve",42.25088735,-91.63212362,"Jim Durbin",adult,Blacklight/Fluorescent,Photograph,1,78,88,74,2,100,29.85,cloudy,"80% visible",
271741,,,,"Metalectra quadrisignata","Four-spotted Fungus Moth",Iowa,Johnson,2020-08-01,22:42:16,Redacted,Redacted,Redacted,"Mark Brown",adult,Sighting,Photograph,1,,,,,,,,,
272139,,,,"Metalectra quadrisignata","Four-spotted Fungus Moth",Iowa,"Van Buren",2020-09-22,21:10:25,"Shimek State Forest, Farmington Unit",40.66548334,-91.73626721,"Jim Durbin",adult,Blacklight/Fluorescent,Photograph,1,70,75,61,6,160,30.09,cloudy,"30% visible",
282210,,,,"Metalectra quadrisignata","Four-spotted Fungus Moth",Iowa,Johnson,2020-08-01,,Redacted,Redacted,Redacted,"Mark Brown",adult,Sighting,Photograph,1,,,,,,,,,
286803,,,,"Metalectra quadrisignata","Four-spotted Fungus Moth",Iowa,Jefferson,2020-07-22,22:54:15,"Near Fairfield",41.05009748,-92.02398156,"Moni Hayne",adult,Blacklight/Fluorescent,Photograph,1,,,,,,,,,
290299,,,,"Metalectra quadrisignata","Four-spotted Fungus Moth",Iowa,Linn,2021-07-08,22:46:45,"Hitaga Sand Ridge Prairie Preserve",42.25145774,-91.63021403,"Jim Durbin",adult,Blacklight/Fluorescent,Photograph,1,69,73,60,5,90,29.89,"partly cloudy","5% visible",
290432,,,,"Metalectra quadrisignata","Four-spotted Fungus Moth",Iowa,Linn,2021-07-08,22:14:53,"Hitaga Sand Ridge Prairie Preserve",42.25145774,-91.63021403,"Jim Durbin",adult,Blacklight/Fluorescent,Photograph,1,69,73,60,5,90,29.89,"partly cloudy","5% visible",
298022,,,,"Metalectra quadrisignata","Four-spotted Fungus Moth",Iowa,Kossuth,2021-08-24,,"Ambrose A. Call State Park",43.0517,-94.2498,"Matt Kenne",adult,"Sugar Bait",Photograph,1,,,,,,,,,
311179,,,,"Metalectra quadrisignata","Four-spotted Fungus Moth",Iowa,Linn,2022-06-28,21:38:49,"Hitaga Sand Ridge Prairie Preserve",42.2510735,-91.63217209,"Jim Durbin",adult,Blacklight/Fluorescent,Photograph,1,75,50,56,6,270,30.04,"partly cloudy","new moon",
311225,,,,"Metalectra quadrisignata","Four-spotted Fungus Moth",Iowa,Linn,2022-06-28,21:21:40,"Hitaga Sand Ridge Prairie Preserve",42.2510735,-91.63217209,"Jim Durbin",adult,Blacklight/Fluorescent,Photograph,1,75,50,56,6,270,30.04,"partly cloudy","new moon",
311524,,,,"Metalectra quadrisignata","Four-spotted Fungus Moth",Iowa,Linn,2022-07-02,21:14:08,"Wanatee County Park",42.01013441,-91.56662262,"Jim Durbin",adult,Blacklight/Fluorescent,Photograph,1,72,61,58,3,190,30.02,clear,"10% moon",
314373,,,,"Metalectra quadrisignata","Four-spotted Fungus Moth",Iowa,Johnson,2022-08-30,20:42:40,"F. W. Kent Park",41.73491755,-91.72195511,"Jim Durbin",adult,Blacklight/Fluorescent,Photograph,1,69,72,60,0,0,30.04,clear,"10% visible",
320837,,,,"Metalectra quadrisignata","Four-spotted Fungus Moth",Iowa,Johnson,2022-07-17,22:47:20,Redacted,Redacted,Redacted,"Mark Brown",adult,Sighting,Photograph,1,,,,,,,,,
333138,,,,"Metalectra quadrisignata","Four-spotted Fungus Moth",Iowa,Johnson,2022-08-24,06:21:39,"MacBride Nature Recreation Area",41.78690624833333,-91.56850041333334,"Mark Brown",adult,Sighting,Photograph,1,,,,,,,,,
336098,,,,"Metalectra quadrisignata","Four-spotted Fungus Moth",Iowa,Linn,2023-06-29,21:48:47,"Indian Creek Nature Center",41.96608977,-91.58982624,"Jim Durbin",adult,Blacklight/Fluorescent,Photograph,1,76,92,74,0,330,29.88,hazy,"50% visible",
336141,,,,"Metalectra quadrisignata","Four-spotted Fungus Moth",Iowa,Linn,2023-06-29,22:13:45,"Indian Creek Nature Center",41.96608977,-91.58982624,"Jim Durbin",adult,Blacklight/Fluorescent,Photograph,1,76,92,74,0,330,29.88,hazy,"50% visible",
336234,,,,"Metalectra quadrisignata","Four-spotted Fungus Moth",Iowa,Linn,2023-06-29,22:55:37,"Indian Creek Nature Center",41.96608977,-91.58982624,"Jim Durbin",adult,Blacklight/Fluorescent,Photograph,1,76,92,74,0,330,29.88,hazy,"50% visible",
337161,,,,"Metalectra quadrisignata","Four-spotted Fungus Moth",Iowa,Linn,2023-07-08,21:56:40,"Palisades Kepler State Park",41.90829802,-91.50242489,"Jim Durbin",adult,Blacklight/Fluorescent,Photograph,1,73,55,53,7,330,29.89,clear,"80% visible",
337249,,,,"Metalectra quadrisignata","Four-spotted Fungus Moth",Iowa,Linn,2023-07-08,22:47:34,"Palisades Kepler State Park",41.90829802,-91.50242489,"Jim Durbin",adult,Blacklight/Fluorescent,Photograph,1,73,55,53,7,330,29.89,clear,"80% visible",
337387,,,,"Metalectra quadrisignata","Four-spotted Fungus Moth",Iowa,Benton,2023-07-11,21:40:31,"Wildcat Bluff Recreational Area",42.19420145,-91.8821574,"Jim Durbin",adult,Blacklight/Fluorescent,Photograph,1,76,59,61,4,330,29.92,cloudy,"50% visible",
337428,,,,"Metalectra quadrisignata","Four-spotted Fungus Moth",Iowa,Benton,2023-07-11,21:55:54,"Wildcat Bluff Recreational Area",42.19420145,-91.8821574,"Jim Durbin",adult,Blacklight/Fluorescent,Photograph,1,76,59,61,4,330,29.92,cloudy,"50% visible",
337442,,,,"Metalectra quadrisignata","Four-spotted Fungus Moth",Iowa,Benton,2023-07-11,22:05:00,"Wildcat Bluff Recreational Area",42.19420145,-91.8821574,"Jim Durbin",adult,Blacklight/Fluorescent,Photograph,1,76,59,61,4,330,29.92,cloudy,"50% visible",
337451,,,,"Metalectra quadrisignata","Four-spotted Fungus Moth",Iowa,Benton,2023-07-11,22:07:53,"Wildcat Bluff Recreational Area",42.19420145,-91.8821574,"Jim Durbin",adult,Blacklight/Fluorescent,Photograph,1,76,59,61,4,330,29.92,cloudy,"50% visible",
337476,,,,"Metalectra quadrisignata","Four-spotted Fungus Moth",Iowa,Benton,2023-07-11,22:21:00,"Wildcat Bluff Recreational Area",42.19420145,-91.8821574,"Jim Durbin",adult,Blacklight/Fluorescent,Photograph,1,76,59,61,4,330,29.92,cloudy,"50% visible",
337543,,,,"Metalectra quadrisignata","Four-spotted Fungus Moth",Iowa,Benton,2023-07-11,22:51:46,"Wildcat Bluff Recreational Area",42.19420145,-91.8821574,"Jim Durbin",adult,Blacklight/Fluorescent,Photograph,1,76,59,61,4,330,29.92,cloudy,"50% visible",
337645,,,,"Metalectra quadrisignata","Four-spotted Fungus Moth",Iowa,Story,2023-07-13,22:07:18,"Reiman Gardens Area, Ames",42.01002794,-93.63860655,"Jim Durbin",adult,Blacklight/Fluorescent,Photograph,1,,,,,,,,,
358729,,,,"Metalectra quadrisignata","Four-spotted Fungus Moth",Iowa,Winneshiek,2018-09-13,,"Roslien Woods",43.3244,-91.8216,"Lena Schmitt",adult,,,1,,,,,,,,,"Data from Kirk Larsen, Luther College"
358730,,,,"Metalectra quadrisignata","Four-spotted Fungus Moth",Iowa,Winneshiek,2018-07-17,,"Roslien Woods",43.3244,-91.8216,"Lena Schmitt",adult,,,1,,,,,,,,,"Data from Kirk Larsen, Luther College"
367072,,,,"Metalectra quadrisignata","Four-spotted Fungus Moth",Iowa,Linn,2024-06-13,21:57:57,"Palisades Kepler State Park",41.908442985,-91.502353318333,"Jim Durbin",adult,Blacklight/Fluorescent,Photograph,1,79,42,54,6,0,29.88,clear,"40 % visible",
