ID,"Collection / Source","Catalog Number","Specify Number",Taxon,"Common Name",State,County,Date,Time,Locale,Latitude,Longitude,Collector,"Life Stage","Collection Method","Preparation Type",Count,Temperature,Humidity,"Dew Point",Wind,"Wind Direction","Barometric Pressure",Sky,"Moon Phase",Notes
11130,,2014-011412,SPM020777,"Anarta trifolii","Nutmeg Moth",Iowa,Linn,2010-08-06,,"Wickiup Hill Outdoor Learning Area",42.08398,-91.7651,"Frank Olsen",adult,,Pinned,1,,,,,,,,,"Located at Iowa State"
15161,,2014-015457,SPM037555,"Anarta trifolii","Nutmeg Moth",Iowa,Kossuth,2013-07-29,,"Ambrose A. Call State Park",43.0517,-94.2498,"Matt Kenne",adult,,Photograph,1,,,,,,,,,
66793,,2014-067398,,"Anarta trifolii","Nutmeg Moth",Iowa,Winneshiek,2013-08-17,,"100 Acre Wood-x",0,0,"MJ Hatfield",adult,,Photograph,1,,,,,,,,,
132302,,2015-022893,,"Anarta trifolii","Nutmeg Moth",Iowa,Story,2015-08-26,,"Ames, Paul",42.02064,-93.623952,"Paul Martsching",adult,"Building Light",Sighting,2,,,,,,,,,
132303,,2015-022894,,"Anarta trifolii","Nutmeg Moth",Iowa,Story,2015-08-07,,"Ames, Paul",42.02064,-93.623952,"Paul Martsching",adult,"Building Light",Sighting,1,,,,,,,,,
136744,,2016-001286,,"Anarta trifolii","Nutmeg Moth",Iowa,Story,2003-08-04,,"Ames, Paul",42.02064,-93.623952,"Paul Martsching",adult,"Building Light",Photograph,1,,,,,,,,,
136745,,2016-001287,,"Anarta trifolii","Nutmeg Moth",Iowa,Story,2004-08-02,,"Ames, Paul",42.02064,-93.623952,"Paul Martsching",adult,"Building Light",Photograph,1,,,,,,,,,
136746,,2016-001288,,"Anarta trifolii","Nutmeg Moth",Iowa,Story,2009-06-24,,"Ames, Paul",42.02064,-93.623952,"Paul Martsching",adult,"Building Light",Photograph,1,,,,,,,,,
175954,"Paul Martsching Collection",2016-040704,,"Anarta trifolii","Nutmeg Moth",Iowa,Story,2016-07-01,,"Ames, Paul",42.02064,-93.623952,"Paul Martsching",adult,"Building Light",Pinned,1,,,,,,,,,
175955,"Paul Martsching Collection",2016-040705,,"Anarta trifolii","Nutmeg Moth",Iowa,Story,2016-08-07,,"Ames, Paul",42.02064,-93.623952,"Paul Martsching",adult,"Building Light",Pinned,1,,,,,,,,,
179673,,2016-044423,,"Anarta trifolii","Nutmeg Moth",Iowa,Story,2016-07-12,,"Ames, Paul",42.02064,-93.623952,"Paul Martsching",adult,"Building Light",Sighting,1,,,,,,,,,"12 July (12/13 July) hi 84 deg; wind W ~10 mph; partly cloudy early am; mostly clear pm.  13 July 100-300 am CDST: 75 deg; wind S 5 mph; partly cloudy; at 100 am 1/2 lit Moon low in SW obscured by clouds.  Lots of beetles !!!  NLC: fair; N Gr Swift Stop: poor; Staples: good."
179674,,2016-044424,,"Anarta trifolii","Nutmeg Moth",Iowa,Story,2016-08-09,,"Ames, Paul",42.02064,-93.623952,"Paul Martsching",adult,"Building Light",Sighting,1,,,,,,,,,"09 Aug 2016 hi 86/74 partly cloudy; wind S ~5mph.  10 Aug 1230-130 am 71/71 SE 5 mph; clear; meteors, then; 400-500 am 68/68 SE 3 mph & fog.  Alcove lights were off at Movies-12 at 4 am; more crickets than last night at Staples.  "
179675,,2016-044425,,"Anarta trifolii","Nutmeg Moth",Iowa,Story,2016-08-22,,"Ames, Paul",42.02064,-93.623952,"Paul Martsching",adult,"Building Light",Sighting,1,,,,,,,,,"22 Aug 2016 81/63 mostly clear; strong & gusty S wind.  1245-315 am CDST 23 Aug 65 deg; wind S 10 mph; 2/3 lit Moon; cirrus sky."
179676,,2016-044426,,"Anarta trifolii","Nutmeg Moth",Iowa,Story,2016-08-25,,"Ames, Paul",42.02064,-93.623952,"Paul Martsching",adult,"Building Light",Sighting,1,,,,,,,,,"25 Aug 2016 77/63 calm > N 5 mph; overcast till 5 pm; then partly cloudy.  1 - 3 am CDST 26 Aug 62 deg; overcast > partly cloudy; N 5 mph; 1/3 lit Moon."
179677,,2016-044427,,"Anarta trifolii","Nutmeg Moth",Iowa,Story,2016-09-03,,"Ames, Paul",42.02064,-93.623952,"Paul Martsching",adult,"Building Light",Sighting,1,,,,,,,,,"03 Sep 2016 75/61 SE ~ 10 mph; partly cloudy.  100 - 300 am CDST 04 Sep 62 deg; SE 5 mph; mostly cloudy"
179678,,2016-044428,,"Anarta trifolii","Nutmeg Moth",Iowa,Story,2016-09-05,,"Ames, Paul",42.02064,-93.623952,"Paul Martsching",adult,"Building Light",Sighting,1,,,,,,,,,"05 Sep 2016 88/74 S 10-15 mph mostly cloudy am; partly cloudy pm.  06 Sep 100-430 am 75 > 72 deg; S 10 mph; clear; humid.  Lot of katydids."
198416,"Paul Martsching Collection",2017-016350,,"Anarta trifolii","Nutmeg Moth",Iowa,Story,2017-08-31,,"Ames, Paul",42.02064,-93.623952,"Paul Martsching",adult,"Building Light",Pinned,1,,,,,,,,,
198417,,2017-016351,,"Anarta trifolii","Nutmeg Moth",Iowa,Story,2017-09-22,,"Ames, Paul",42.02064,-93.623952,"Paul Martsching",adult,"Building Light",Sighting,1,,,,,,,,,
206965,,2018-005130,,"Anarta trifolii","Nutmeg Moth",Iowa,Story,2003-07-25,,"Ames, Paul",42.02064,-93.623952,"Paul Martsching",adult,"Building Light",Sighting,1,,,,,,,,,
206966,,2018-005131,,"Anarta trifolii","Nutmeg Moth",Iowa,Story,2003-08-15,,"Ames, Paul",42.02064,-93.623952,"Paul Martsching",adult,"Building Light",Sighting,5,,,,,,,,,
206967,,2018-005132,,"Anarta trifolii","Nutmeg Moth",Iowa,Story,2003-09-08,,"Ames, Paul",42.02064,-93.623952,"Paul Martsching",adult,"Building Light",Sighting,2,,,,,,,,,
206968,,2018-005133,,"Anarta trifolii","Nutmeg Moth",Iowa,Story,2004-07-18,,"Ames, Paul",42.02064,-93.623952,"Paul Martsching",adult,"Building Light",Sighting,2,,,,,,,,,
206969,,2018-005134,,"Anarta trifolii","Nutmeg Moth",Iowa,Story,2004-08-15,,"Ames, Paul",42.02064,-93.623952,"Paul Martsching",adult,"Building Light",Sighting,4,,,,,,,,,
206970,,2018-005135,,"Anarta trifolii","Nutmeg Moth",Iowa,Story,2004-09-26,,"Ames, Paul",42.02064,-93.623952,"Paul Martsching",adult,"Building Light",Sighting,1,,,,,,,,,
206971,,2018-005136,,"Anarta trifolii","Nutmeg Moth",Iowa,Story,2005-07-04,,"Ames, Paul",42.02064,-93.623952,"Paul Martsching",adult,"Building Light",Sighting,6,,,,,,,,,
206972,,2018-005137,,"Anarta trifolii","Nutmeg Moth",Iowa,Story,2005-08-15,,"Ames, Paul",42.02064,-93.623952,"Paul Martsching",adult,"Building Light",Sighting,20,,,,,,,,,
206973,,2018-005138,,"Anarta trifolii","Nutmeg Moth",Iowa,Story,2005-09-12,,"Ames, Paul",42.02064,-93.623952,"Paul Martsching",adult,"Building Light",Sighting,5,,,,,,,,,
206974,,2018-005139,,"Anarta trifolii","Nutmeg Moth",Iowa,Story,2006-05-22,,"Ames, Paul",42.02064,-93.623952,"Paul Martsching",adult,"Building Light",Sighting,1,,,,,,,,,
206975,,2018-005140,,"Anarta trifolii","Nutmeg Moth",Iowa,Story,2006-06-15,,"Ames, Paul",42.02064,-93.623952,"Paul Martsching",adult,"Building Light",Sighting,3,,,,,,,,,
206976,,2018-005141,,"Anarta trifolii","Nutmeg Moth",Iowa,Story,2006-07-15,,"Ames, Paul",42.02064,-93.623952,"Paul Martsching",adult,"Building Light",Sighting,6,,,,,,,,,
206977,,2018-005142,,"Anarta trifolii","Nutmeg Moth",Iowa,Story,2006-08-15,,"Ames, Paul",42.02064,-93.623952,"Paul Martsching",adult,"Building Light",Sighting,25,,,,,,,,,
206978,,2018-005143,,"Anarta trifolii","Nutmeg Moth",Iowa,Story,2006-09-15,,"Ames, Paul",42.02064,-93.623952,"Paul Martsching",adult,"Building Light",Sighting,5,,,,,,,,,
206979,,2018-005144,,"Anarta trifolii","Nutmeg Moth",Iowa,Story,2006-10-02,,"Ames, Paul",42.02064,-93.623952,"Paul Martsching",adult,"Building Light",Sighting,1,,,,,,,,,
206980,,2018-005145,,"Anarta trifolii","Nutmeg Moth",Iowa,Story,2007-05-10,,"Ames, Paul",42.02064,-93.623952,"Paul Martsching",adult,"Building Light",Sighting,1,,,,,,,,,
206981,,2018-005146,,"Anarta trifolii","Nutmeg Moth",Iowa,Story,2007-08-18,,"Ames, Paul",42.02064,-93.623952,"Paul Martsching",adult,"Building Light",Sighting,1,,,,,,,,,
206982,,2018-005147,,"Anarta trifolii","Nutmeg Moth",Iowa,Story,2008-08-23,,"Ames, Paul",42.02064,-93.623952,"Paul Martsching",adult,"Building Light",Sighting,1,,,,,,,,,
206983,,2018-005148,,"Anarta trifolii","Nutmeg Moth",Iowa,Story,2008-09-26,,"Ames, Paul",42.02064,-93.623952,"Paul Martsching",adult,"Building Light",Sighting,2,,,,,,,,,
206984,,2018-005149,,"Anarta trifolii","Nutmeg Moth",Iowa,Story,2009-06-24,,"Ames, Paul",42.02064,-93.623952,"Paul Martsching",adult,"Building Light",Sighting,1,,,,,,,,,
206985,,2018-005150,,"Anarta trifolii","Nutmeg Moth",Iowa,Story,2009-08-18,,"Ames, Paul",42.02064,-93.623952,"Paul Martsching",adult,"Building Light",Sighting,1,,,,,,,,,
206986,,2018-005151,,"Anarta trifolii","Nutmeg Moth",Iowa,Story,2011-07-16,,"Ames, Paul",42.02064,-93.623952,"Paul Martsching",adult,"Building Light",Sighting,1,,,,,,,,,
206987,,2018-005152,,"Anarta trifolii","Nutmeg Moth",Iowa,Story,2011-07-16,,"Ames, Paul",42.02064,-93.623952,"Paul Martsching",adult,"Building Light",Sighting,1,,,,,,,,,
206988,,2018-005153,,"Anarta trifolii","Nutmeg Moth",Iowa,Story,2014-09-27,,"Ames, Paul",42.02064,-93.623952,"Paul Martsching",adult,"Building Light",Sighting,1,,,,,,,,,
216051,,2018-014207,,"Anarta trifolii","Nutmeg Moth",Iowa,Winneshiek,2018-06-13,,"100 Acre Wood-x",0,0,"MJ Hatfield",adult,"Blacklight Trap",Photograph,1,,,,,,,,,
216577,,2018-014733,,"Anarta trifolii","Nutmeg Moth",Iowa,Winneshiek,2018-06-16,,"100 Acre Wood-x",0,0,"MJ Hatfield",adult,"Blacklight Trap",Photograph,1,,,,,,,,,
216580,,2018-014736,,"Anarta trifolii","Nutmeg Moth",Iowa,Winneshiek,2018-06-16,,"100 Acre Wood-x",0,0,"MJ Hatfield",adult,"Blacklight Trap",Photograph,1,,,,,,,,,
224867,,2018-011885,,"Anarta trifolii","Nutmeg Moth",Iowa,Winneshiek,2018-05-17,,"100 Acre Wood-x",0,0,"MJ Hatfield",adult,"Blacklight Trap",Photograph,1,,,,,,,,,
224869,,2018-011976,,"Anarta trifolii","Nutmeg Moth",Iowa,Winneshiek,2018-05-22,,"100 Acre Wood-x",0,0,"MJ Hatfield",adult,"Blacklight Trap",Photograph,1,,,,,,,,,
227311,,2019-002031,,"Anarta trifolii","Nutmeg Moth",Iowa,Story,2018-07-12,,"Ames, Paul",42.02064,-93.623952,"Paul Martsching",adult,"Building Light",Sighting,1,,,,,,,,,
227312,,2019-002032,,"Anarta trifolii","Nutmeg Moth",Iowa,Story,2018-08-07,,"Ames, Paul",42.02064,-93.623952,"Paul Martsching",adult,"Building Light",Sighting,1,,,,,,,,,
227313,,2019-002033,,"Anarta trifolii","Nutmeg Moth",Iowa,Story,2018-08-08,,"Ames, Paul",42.02064,-93.623952,"Paul Martsching",adult,"Building Light",Sighting,1,,,,,,,,,
227314,,2019-002034,,"Anarta trifolii","Nutmeg Moth",Iowa,Story,2018-08-18,,"Ames, Paul",42.02064,-93.623952,"Paul Martsching",adult,"Building Light",Sighting,2,,,,,,,,,
227315,,2019-002035,,"Anarta trifolii","Nutmeg Moth",Iowa,Story,2018-09-11,,"Ames, Paul",42.02064,-93.623952,"Paul Martsching",adult,"Building Light",Sighting,1,,,,,,,,,
227316,,2019-002036,,"Anarta trifolii","Nutmeg Moth",Iowa,Story,2018-10-03,,"Ames, Paul",42.02064,-93.623952,"Paul Martsching",adult,"Building Light",Sighting,1,,,,,,,,,
244487,,,,"Anarta trifolii","Nutmeg Moth",Iowa,Story,2019-08-29,3:30,"Ames, Paul",42.02064,-93.623952,"Paul Martsching",adult,"Building Light",Sighting,1,,,,,,,,,
244488,,,,"Anarta trifolii","Nutmeg Moth",Iowa,Story,2019-09-27,3:30,"Ames, Paul",42.02064,-93.623952,"Paul Martsching",adult,"Building Light",Sighting,1,,,,,,,,,
245850,,,,"Anarta trifolii","Nutmeg Moth",Iowa,Story,2019-08-29,3:30,"Ames, Paul",42.02064,-93.623952,"Paul Martsching",adult,"Building Light",Sighting,1,,,,,,,,,
245851,,,,"Anarta trifolii","Nutmeg Moth",Iowa,Story,2019-09-27,3:30,"Ames, Paul",42.02064,-93.623952,"Paul Martsching",adult,"Building Light",Sighting,1,,,,,,,,,
280161,,,,"Anarta trifolii","Nutmeg Moth",Iowa,Story,2020-06-30,,"Ames, Paul",42.011454,-93.615063,"Paul Martsching",adult,"Building Light",Sighting,1,,,,,,,,,
280162,,,,"Anarta trifolii","Nutmeg Moth",Iowa,Story,2020-08-14,,"Ames, Paul",42.011454,-93.615063,"Paul Martsching",adult,"Building Light",Sighting,1,,,,,,,,,
280163,,,,"Anarta trifolii","Nutmeg Moth",Iowa,Story,2020-08-22,,"Ames, Paul",42.011454,-93.615063,"Paul Martsching",adult,"Building Light",Sighting,1,,,,,,,,,
280164,,,,"Anarta trifolii","Nutmeg Moth",Iowa,Story,2020-08-24,,"Ames, Paul",42.011454,-93.615063,"Paul Martsching",adult,"Building Light",Sighting,1,,,,,,,,,
291377,"jim durbin drawer 157",2021-000124,,"Anarta trifolii","Nutmeg Moth",Iowa,Linn,2021-08-06,21:21:12,"Hitaga Sand Ridge Prairie Preserve",42.25082292,-91.63215158,"Jim Durbin",adult,Blacklight/Fluorescent,Pinned,1,78,72,68,4,165,29.79,cloudy,"new moon",
298234,,,,"Anarta trifolii","Nutmeg Moth",Iowa,Johnson,2021-08-08,,Redacted,Redacted,Redacted,"Mark Brown",adult,Sighting,Photograph,1,,,,,,,,,
298591,,,,"Anarta trifolii","Nutmeg Moth",Iowa,Story,2021-07-12,0500,"Ames, Paul",42.011732,-93.615039,"Paul Martsching",adult,Sighting,Sighting,1,63,,,5,270,,clear,,
298692,,,,"Anarta trifolii","Nutmeg Moth",Iowa,Story,2021-08-07,0500,"Ames, Paul",42.011732,-93.615039,"Paul Martsching",adult,Sighting,Sighting,1,73,,,5,225,,overcast,,
298704,,,,"Anarta trifolii","Nutmeg Moth",Iowa,Story,2021-08-20,0600,"Ames, Paul",42.011732,-93.615039,"Paul Martsching",adult,Sighting,Sighting,1,67,,,5,135,,clear,,
309005,"Jim Durbin Drawer 157",2022-000274,,"Anarta trifolii","Nutmeg Moth",Iowa,Linn,2010-08-06,,"Wickiup Hill Outdoor Learning Area",42.083833,-91.764772,"Frank Olsen",adult,Blacklighting,Pinned,1,,,,,,,,,
321299,,,,"Anarta trifolii","Nutmeg Moth",Iowa,Story,2022-05-05,0700,"Ames, Paul",42.011954,-93.615226,"Paul Martsching",adult,"Building Light",Sighting,1,51,,,90,9,,overcast,,
340958,,,,"Anarta trifolii","Nutmeg Moth",Iowa,Linn,2023-08-25,21:59:47,"Hitaga Sand Ridge Prairie Preserve",42.25093191,-91.63218534,"Jim Durbin",adult,Blacklight/Fluorescent,Photograph,1,81,72,71,5,345,29.93,clear,"60% visible",
355507,,,,"Anarta trifolii","Nutmeg Moth",Iowa,Winneshiek,2018-08-08,,"Spilde Woods",43.317783,-91.812417,"Lena Schmitt",adult,,,1,,,,,,,,,"Data from Kirk Larsen, Luther College"
356411,,,,"Anarta trifolii","Nutmeg Moth",Iowa,Winneshiek,2018-08-07,,"Jewell Prairie",43.31883333,-91.82283333,"Lena Schmitt",adult,,,1,,,,,,,,,"Data from Kirk Larsen, Luther College"
