ID,"Collection / Source","Catalog Number","Specify Number",Taxon,"Common Name",State,County,Date,Time,Locale,Latitude,Longitude,Collector,"Life Stage","Collection Method","Preparation Type",Count,Temperature,Humidity,"Dew Point",Wind,"Wind Direction","Barometric Pressure",Sky,"Moon Phase",Notes
1083,"Jim Durbin Drawer 352",2014-001083,SPM001028,"Neotibicen pruinosus","Scissor Grinder",Iowa,Linn,2004-08-16,,"1460 Douglas Ct, Marion",42.040069,-91.590953,"Jim Durbin",adult,Net,Pinned,1,,,,,,,,,
1084,"Jim Durbin Drawer 352",2014-001084,SPM001029,"Neotibicen pruinosus","Scissor Grinder",Iowa,Linn,2004-08-16,,"1460 Douglas Ct, Marion",42.040069,-91.590953,"Jim Durbin",adult,Net,Pinned,1,,,,,,,,,
10980,,2014-011262,SPM019621,"Neotibicen pruinosus","Scissor Grinder",Kentucky,Ohio,2010-05-01,,Redacted,Redacted,Redacted,"Jourdan Yeckering",adult,,Pinned,1,,,,,,,,,
10981,,2014-011263,SPM019622,"Neotibicen pruinosus","Scissor Grinder",Kentucky,Ohio,2010-05-01,,Redacted,Redacted,Redacted,"Jourdan Yeckering",adult,,Pinned,1,,,,,,,,,
10982,,2014-011264,SPM019626,"Neotibicen pruinosus","Scissor Grinder",Kentucky,Ohio,2010-05-01,,Redacted,Redacted,Redacted,"Jourdan Yeckering",adult,,Pinned,1,,,,,,,,,
10988,"Jim Durbin Drawer 352",2014-011270,SPM023423,"Neotibicen pruinosus","Scissor Grinder",Kentucky,Daviess,2011-08-11,,"5031 Old Lyddane Bridge Road",37.746807,-87.185997,"Jim Durbin",adult,Sighting,Pinned,1,,,,,,,,,
10989,"Jim Durbin Drawer 352",2014-011271,SPM023424,"Neotibicen pruinosus","Scissor Grinder",Kentucky,Daviess,2011-08-11,,"5031 Old Lyddane Bridge Road",37.746807,-87.185997,"Jim Durbin",adult,Sighting,Pinned,1,,,,,,,,,
47823,"Jim Durbin Drawer 352",2014-048201,SPM000973,"Neotibicen pruinosus","Scissor Grinder",Iowa,Linn,2004-08-16,,"1460 Douglas Ct, Marion",42.040069,-91.590953,"Jim Durbin",adult,Net,Pinned,1,,,,,,,,,
47824,"Jim Durbin Drawer 352",2014-048202,SPM001531,"Neotibicen pruinosus","Scissor Grinder",Kentucky,Daviess,2001-10-20,,"Panther Creek Park",37.71538,-87.21873,"Jim Durbin",adult,Net,Pinned,1,,,,,,,,,
47825,"Jim Durbin Drawer 352",2014-048203,SPM001533,"Neotibicen pruinosus","Scissor Grinder",Kentucky,Daviess,2001-10-20,,"Panther Creek Park",37.71538,-87.21873,"Jim Durbin",adult,Net,Pinned,1,,,,,,,,,
47826,"Jim Durbin Drawer 352",2014-048204,SPM001534,"Neotibicen pruinosus","Scissor Grinder",Iowa,Linn,2001-08-03,,"1460 Douglas Ct, Marion",42.040069,-91.590953,"Jim Durbin",adult,Net,Pinned,1,,,,,,,,,
47827,"Jim Durbin Drawer 352",2014-048205,SPM001535,"Neotibicen pruinosus","Scissor Grinder",Iowa,Linn,2001-08-03,,"1460 Douglas Ct, Marion",42.040069,-91.590953,"Jim Durbin",adult,Net,Pinned,1,,,,,,,,,
47828,,2014-048206,SPM029671,"Neotibicen pruinosus","Scissor Grinder",Iowa,Linn,2012-07-03,,"1460 Douglas Ct, Marion",42.040069,-91.590953,"Jim Durbin",adult,Blacklight/Fluorescent,Photograph,1,,,,,,,,,
47829,,2014-048207,SPM029672,"Neotibicen pruinosus","Scissor Grinder",Iowa,Linn,2012-07-03,,"1460 Douglas Ct, Marion",42.040069,-91.590953,"Jim Durbin",adult,Blacklight/Fluorescent,Photograph,1,,,,,,,,,
47830,,2014-048208,SPM029673,"Neotibicen pruinosus","Scissor Grinder",Iowa,Linn,2012-07-03,,"1460 Douglas Ct, Marion",42.040069,-91.590953,"Jim Durbin",adult,Blacklight/Fluorescent,Photograph,1,,,,,,,,,
47831,,2014-048209,SPM030780,"Neotibicen pruinosus","Scissor Grinder",Iowa,Linn,2012-07-22,,"Wakpicada Natural Area",42.18892,-91.52035,"Jim Durbin",adult,Blacklight/Fluorescent,Photograph,1,,,,,,,,,
47832,,2014-048210,SPM030781,"Neotibicen pruinosus","Scissor Grinder",Iowa,Linn,2012-07-22,,"Wakpicada Natural Area",42.18892,-91.52035,"Jim Durbin",adult,Blacklight/Fluorescent,Photograph,1,,,,,,,,,
47833,,2014-048211,SPM030782,"Neotibicen pruinosus","Scissor Grinder",Iowa,Linn,2012-07-22,,"Wakpicada Natural Area",42.18892,-91.52035,"Jim Durbin",adult,Blacklight/Fluorescent,Photograph,1,,,,,,,,,
47834,,2014-048212,SPM030783,"Neotibicen pruinosus","Scissor Grinder",Iowa,Linn,2012-07-19,,"1460 Douglas Ct, Marion",42.040069,-91.590953,"Jim Durbin",adult,"Building Light",Photograph,1,,,,,,,,,
47835,"Jim Durbin Drawer 352",2014-048213,SPM030785,"Neotibicen pruinosus","Scissor Grinder",Iowa,Linn,2012-07-22,,"1460 Douglas Ct, Marion",42.040069,-91.590953,"Jim Durbin",adult,"Building Light",Pinned,1,,,,,,,,,
47836,,2014-048214,SPM030786,"Neotibicen pruinosus","Scissor Grinder",Iowa,Linn,2012-07-22,,"1460 Douglas Ct, Marion",42.040069,-91.590953,"Jim Durbin",adult,"Building Light",Photograph,1,,,,,,,,,
64620,,2014-065221,,"Neotibicen pruinosus","Scissor Grinder",Iowa,Linn,2014-08-22,,"Pleasant Creek State Recreation Area, Linn County",42.110327,-91.822988,"Jim Durbin",adult,Blacklight/Fluorescent,Photograph,1,,,,,,,,,
65209,,2014-065810,,"Neotibicen pruinosus","Scissor Grinder",Iowa,Linn,2014-08-30,2000-2300DST,"Pleasant Creek State Recreation Area, Linn County",42.110327,-91.822988,"Jim Durbin",adult,Blacklight/Fluorescent,Photograph,1,77-69,73-97,68-66,4,0,29.88,"Partly Cloudy",,
129377,"Jim Durbin Drawer 352",2015-019967,,"Neotibicen pruinosus","Scissor Grinder",Iowa,Linn,2015-08-21,2030-2230,"Indian Creek Nature Center",41.968932,-91.586884,"Jim Durbin",adult,Blacklight/Fluorescent,Pinned,1,73,61,58,4,160,29.95,clear,"30% visible",
129977,,2015-020567,,"Neotibicen pruinosus","Scissor Grinder",Iowa,Linn,2015-09-01,"2000 - 2230","Indian Creek Nature Center",41.968932,-91.586884,"Jim Durbin",adult,Blacklight/Fluorescent,Photograph,1,81,71,71,2,180,29.96,cloudy,"95% visible",
172141,,2016-036886,,"Neotibicen pruinosus","Scissor Grinder",Iowa,Linn,2016-07-14,Male,"1460 Douglas Ct, Marion",42.040069,-91.590953,"Jim Durbin",adult,Sighting,Photograph,1,71,74,62,2,345,29.92,clear,"80% visible",
172142,,2016-036887,,"Neotibicen pruinosus","Scissor Grinder",Iowa,Linn,2016-07-14,"cicada found dead on deck. Female","1460 Douglas Ct, Marion",42.040069,-91.590953,"Jim Durbin",adult,Sighting,Photograph,1,71,74,62,2,345,29.92,clear,"80% visible",
173314,,2016-038060,,"Neotibicen pruinosus","Scissor Grinder",Iowa,Linn,2016-08-03,,"1460 Douglas Ct, Marion",42.040069,-91.590953,"Jim Durbin",adult,Blacklight/Fluorescent,Photograph,1,,,,,,,,,
173316,,2016-038062,,"Neotibicen pruinosus","Scissor Grinder",Iowa,Linn,2016-08-03,,"1460 Douglas Ct, Marion",42.040069,-91.590953,"Jim Durbin",adult,Blacklight/Fluorescent,Photograph,1,,,,,,,,,
173319,,2016-038065,,"Neotibicen pruinosus","Scissor Grinder",Iowa,Linn,2016-08-03,,"1460 Douglas Ct, Marion",42.040069,-91.590953,"Jim Durbin",adult,Blacklight/Fluorescent,Photograph,1,,,,,,,,,
173320,,2016-038066,,"Neotibicen pruinosus","Scissor Grinder",Iowa,Linn,2016-08-03,,"1460 Douglas Ct, Marion",42.040069,-91.590953,"Jim Durbin",adult,Blacklight/Fluorescent,Photograph,1,,,,,,,,,
173321,,2016-038067,,"Neotibicen pruinosus","Scissor Grinder",Iowa,Linn,2016-08-03,,"1460 Douglas Ct, Marion",42.040069,-91.590953,"Jim Durbin",adult,Blacklight/Fluorescent,Photograph,1,,,,,,,,,
174200,,2016-038950,,"Neotibicen pruinosus","Scissor Grinder",Iowa,Linn,2016-08-08,,"1460 Douglas Ct, Marion",42.040069,-91.590953,"Jim Durbin",adult,Blacklight/Fluorescent,Photograph,1,,,,,,,,,
174201,,2016-038951,,"Neotibicen pruinosus","Scissor Grinder",Iowa,Linn,2016-08-08,,"1460 Douglas Ct, Marion",42.040069,-91.590953,"Jim Durbin",adult,Blacklight/Fluorescent,Photograph,1,,,,,,,,,
174202,,2016-038952,,"Neotibicen pruinosus","Scissor Grinder",Iowa,Linn,2016-08-08,,"1460 Douglas Ct, Marion",42.040069,-91.590953,"Jim Durbin",adult,Blacklight/Fluorescent,Photograph,1,,,,,,,,,
174206,,2016-038956,,"Neotibicen pruinosus","Scissor Grinder",Iowa,Linn,2016-08-09,,"1460 Douglas Ct, Marion",42.040069,-91.590953,"Jim Durbin",adult,Sighting,Photograph,1,,,,,,,,,
181549,,2016-046639,,"Neotibicen pruinosus","Scissor Grinder",Iowa,Polk,2016-08-06,,"Big Creek State Park",41.807055,-93.745185,"Mark Brown",adult,,Photograph,1,,,,,,,,,
182322,,2017-000283,,"Neotibicen pruinosus","Scissor Grinder",Iowa,Johnson,2014-08-26,,"University Hospitals",41.65974,-91.549203,"Mark Brown",adult,,Photograph,1,,,,,,,,,
186157,,2017-004118,,"Neotibicen pruinosus","Scissor Grinder",Iowa,Johnson,2014-08-26,,"University Hospitals",41.65974,-91.549203,"Mark Brown",adult,,Photograph,1,,,,,,,,,
193829,,2017-011820,,"Neotibicen pruinosus","Scissor Grinder",Iowa,Linn,2017-07-12,,"1460 Douglas Ct, Marion",42.040069,-91.590953,"Jim Durbin",adult,Blacklight/Fluorescent,Photograph,1,,,,,,,,,
194430,,2017-012396,,"Neotibicen pruinosus","Scissor Grinder",Iowa,Linn,2017-07-17,"Specimen sent to Bill Reynolds","1460 Douglas Ct, Marion",42.040069,-91.590953,"Jim Durbin",adult,Blacklight/Fluorescent,Photograph,1,,,,,,,,,
194431,,2017-012397,,"Neotibicen pruinosus","Scissor Grinder",Iowa,Linn,2017-07-17,"Specimen sent to Bill Reynolds","1460 Douglas Ct, Marion",42.040069,-91.590953,"Jim Durbin",adult,Blacklight/Fluorescent,Photograph,1,,,,,,,,,
194432,,2017-012398,,"Neotibicen pruinosus","Scissor Grinder",Iowa,Linn,2017-07-17,"Specimen sent to Bill Reynolds","1460 Douglas Ct, Marion",42.040069,-91.590953,"Jim Durbin",adult,Blacklight/Fluorescent,Photograph,1,,,,,,,,,
194433,,2017-012399,,"Neotibicen pruinosus","Scissor Grinder",Iowa,Linn,2017-07-17,"Specimen sent to Bill Reynolds","1460 Douglas Ct, Marion",42.040069,-91.590953,"Jim Durbin",adult,Blacklight/Fluorescent,Photograph,1,,,,,,,,,
194434,,2017-012400,,"Neotibicen pruinosus","Scissor Grinder",Iowa,Linn,2017-07-22,"Specimen sent to Bill Reynolds","1460 Douglas Ct, Marion",42.040069,-91.590953,"Jim Durbin",adult,Blacklight/Fluorescent,Photograph,1,,,,,,,,,
194435,,2017-012401,,"Neotibicen pruinosus","Scissor Grinder",Iowa,Linn,2017-07-22,"Specimen sent to Bill Reynolds","1460 Douglas Ct, Marion",42.040069,-91.590953,"Jim Durbin",adult,Blacklight/Fluorescent,Photograph,1,,,,,,,,,
194436,,2017-012402,,"Neotibicen pruinosus","Scissor Grinder",Iowa,Linn,2017-07-25,,"1460 Douglas Ct, Marion",42.040069,-91.590953,"Jim Durbin",adult,Blacklight/Fluorescent,Photograph,1,,,,,,,,,"Specimen sent to Bill Reynolds"
194437,,2017-012403,,"Neotibicen pruinosus","Scissor Grinder",Iowa,Linn,2017-07-23,,"Willow Park, Marion",42.036503,-91.609012,"Jim Durbin",adult,Blacklight/Fluorescent,Photograph,1,,,,,,,,,"Specimen sent to Bill Reynolds"
194438,,2017-012404,,"Neotibicen pruinosus","Scissor Grinder",Iowa,Linn,2017-07-25,,"1460 Douglas Ct, Marion",42.040069,-91.590953,"Jim Durbin",adult,Blacklight/Fluorescent,Photograph,1,,,,,,,,,"Specimen sent to Bill Reynolds"
194867,,2017-012831,,"Neotibicen pruinosus","Scissor Grinder",Iowa,Linn,2017-07-30,,"1460 Douglas Ct, Marion",42.040069,-91.590953,"Jim Durbin",adult,Blacklight/Fluorescent,Photograph,1,,,,,,,,,
195553,,2017-013517,,"Neotibicen pruinosus","Scissor Grinder",Iowa,Linn,2017-08-18,2030-2300,"Wickiup Hill Outdoor Learning Area",42.087567,-91.767578,"Jim Durbin",adult,Blacklight/Fluorescent,Photograph,1,71,73,62,5,10,29.88,clear,"20% visible",
196560,,2017-014494,,"Neotibicen pruinosus","Scissor Grinder",Kentucky,Daviess,2017-09-19,,"5031 Old Lyddane Bridge Road",37.746771,-87.185979,"Jim Durbin",adult,Blacklight/Fluorescent,Photograph,1,,,,,,,,,
196590,,2017-014524,,"Neotibicen pruinosus","Scissor Grinder",Kentucky,Daviess,2017-09-19,,"5031 Old Lyddane Bridge Road",37.746771,-87.185979,"Jim Durbin",adult,Blacklight/Fluorescent,Photograph,1,,,,,,,,,
201528,,2017-019457,,"Neotibicen pruinosus","Scissor Grinder",Iowa,Jefferson,2017-07-27,,"Jefferson County Park",40.98639,-91.99111,"Moni Hayne",adult,,Photograph,1,,,,,,,,,
201625,,2017-019554,,"Neotibicen pruinosus","Scissor Grinder",Iowa,Jefferson,2017-07-27,,"Jefferson County Park",40.98639,-91.99111,"Moni Hayne",adult,,Photograph,1,,,,,,,,,
214090,,2018-012246,,"Neotibicen pruinosus","Scissor Grinder",Iowa,Linn,2018-06-19,,"1460 Douglas Ct, Marion",42.040069,-91.590953,"Jim Durbin",adult,Blacklight/Fluorescent,Photograph,1,,,,,,,,,
217011,,2018-015167,,"Neotibicen pruinosus","Scissor Grinder",Iowa,Linn,2018-08-01,"2045-2215. Quit early because of storms.","Wickiup Hill Outdoor Learning Area",42.087352,-91.767107,"Jim Durbin",adult,Blacklight/Fluorescent,Photograph,1,77,52,58,1,180,29.97,cloudy,"95% visible",
219119,,2018-017275,,"Neotibicen pruinosus","Scissor Grinder",Iowa,Linn,2018-08-19,,"Wickiup Hill Outdoor Learning Area",42.087352,-91.767107,"Jim Durbin",adult,Blacklight/Fluorescent,Photograph,1,75,72,65,3,90,29.84,"partly cloudy","50% visible",
220418,,2018-018574,,"Neotibicen pruinosus","Scissor Grinder",Kentucky,Daviess,2018-09-15,,"5031 Old Lyddane Bridge Road",37.746771,-87.185979,"Jim Durbin",adult,Blacklight/Fluorescent,Photograph,1,,,,,,,,,
229720,,2019-004434,,"Neotibicen pruinosus","Scissor Grinder",Iowa,Jefferson,2018-07-10,,"Near Fairfield",41.0503,-92.024,"Moni Hayne",adult,,Photograph,1,,,,,,,,,
234201,,,,"Neotibicen pruinosus","Scissor Grinder",Iowa,Johnson,2019-07-26,2100-2315,"F. W. Kent Park",41.734938,-91.721911,"Jim Durbin",adult,Blacklight/Fluorescent,Photograph,1,74,74,65,10,190,30.07,clear,"50% visible",
234227,,,,"Neotibicen pruinosus","Scissor Grinder",Iowa,Johnson,2019-07-26,2100-2315,"F. W. Kent Park",41.734938,-91.721911,"Jim Durbin",adult,Blacklight/Fluorescent,Photograph,1,74,74,65,10,190,30.07,clear,"50% visible",
234245,,,,"Neotibicen pruinosus","Scissor Grinder",Iowa,Johnson,2019-07-26,2100-2315,"F. W. Kent Park",41.734938,-91.721911,"Jim Durbin",adult,Blacklight/Fluorescent,Photograph,1,74,74,65,10,190,30.07,clear,"50% visible",
234349,,,,"Neotibicen pruinosus","Scissor Grinder",Iowa,Johnson,2019-07-26,2100-2315,"F. W. Kent Park",41.734938,-91.721911,"Jim Durbin",adult,Blacklight/Fluorescent,Photograph,1,74,74,65,10,190,30.07,clear,"50% visible",
235070,,,,"Neotibicen pruinosus","Scissor Grinder",Iowa,Dubuque,2019-08-07,9:58:16,Dubuque,42.474381,-90.70533,"Miguel  Quintana",adult,Sighting,Photograph,1,,,,,,,,,"It appeared in my screened porch (outside)."
236280,,,,"Neotibicen pruinosus","Scissor Grinder",Iowa,Linn,2019-08-17,2030-2300,"Hitaga Sand Ridge Prairie Preserve",42.25226,-91.63040167,"Jim Durbin",adult,Blacklight/Fluorescent,Photograph,1,79,62,65,1,180,29.71,"parthly cloudy","Full Moon",
236312,,,,"Neotibicen pruinosus","Scissor Grinder",Iowa,Linn,2019-08-17,2030-2300,"Hitaga Sand Ridge Prairie Preserve",42.25226,-91.63040167,"Jim Durbin",adult,Blacklight/Fluorescent,Photograph,1,79,62,65,1,180,29.71,"parthly cloudy","Full Moon",
236341,,,,"Neotibicen pruinosus","Scissor Grinder",Iowa,Linn,2019-08-17,2030-2300,"Hitaga Sand Ridge Prairie Preserve",42.25226,-91.63040167,"Jim Durbin",adult,Blacklight/Fluorescent,Photograph,1,79,62,65,1,180,29.71,"parthly cloudy","Full Moon",
240284,"Jim Durbin Drawer 352",2014-000249,SPM001028,"Neotibicen pruinosus","Scissor Grinder",Iowa,Linn,2004-08-16,,"1460 Douglas Ct, Marion",42.040069,-91.590953,"Jim Durbin",adult,Sighting,Pinned,1,,,,,,,,,
240285,"Jim Durbin Drawer 352",2014-000260,SPM001029,"Neotibicen pruinosus","Scissor Grinder",Iowa,Linn,2004-08-16,,"1460 Douglas Ct, Marion",42.040069,-91.590953,"Jim Durbin",adult,Sighting,Pinned,1,,,,,,,,,
263868,,,,"Neotibicen pruinosus","Scissor Grinder",Iowa,Story,2011-07-29,22:34:20,"McFarland Park",42.094377,-93.572681,"Moni Hayne",adult,"Building Light",Photograph,1,,,,,,,,,
269139,,,,"Neotibicen pruinosus","Scissor Grinder",Iowa,Linn,2020-07-30,22:51:01,"Matsell Bridge Natural Area",42.1321277,-91.38531247,"Jim Durbin",adult,Blacklight/Fluorescent,Photograph,1,77,75,68,6,45,29.88,"partly cloudy","80% visible",
291602,,,,"Neotibicen pruinosus","Scissor Grinder",Iowa,Linn,2021-08-11,22:48:53,"Pleasant Creek State Recreation Area, Linn County",42.11043641,-91.82716239,"Jim Durbin",adult,Blacklight/Fluorescent,Photograph,1,84,66,72,6,270,29.66,"partly cloudy","10% visible",
291676,,,,"Neotibicen pruinosus","Scissor Grinder",Iowa,Linn,2021-08-11,22:18:26,"Pleasant Creek State Recreation Area, Linn County",42.11043641,-91.82716239,"Jim Durbin",adult,Blacklight/Fluorescent,Photograph,1,84,66,72,6,270,29.66,"partly cloudy","10% visible",
291795,,,,"Neotibicen pruinosus","Scissor Grinder",Iowa,Linn,2021-08-11,21:18:57,"Pleasant Creek State Recreation Area, Linn County",42.11043641,-91.82716239,"Jim Durbin",adult,Blacklight/Fluorescent,Photograph,1,84,66,72,6,270,29.66,"partly cloudy","10% visible",
292080,,,,"Neotibicen pruinosus","Scissor Grinder",Iowa,Linn,2021-08-15,21:03:02,"Pinicon Ridge Park",42.21087488,-91.54432767,"Jim Durbin",adult,Blacklight/Fluorescent,Photograph,1,72,46,50,3,90,29.96,clear,"50% visible",
312267,,,,"Neotibicen pruinosus","Scissor Grinder",Iowa,Linn,2022-07-22,16:04:14,"1460 Douglas Ct, Marion",42.040069,-91.590953,"Jim Durbin",adult,Sighting,Photograph,1,,,,,,,,,
312324,,,,"Neotibicen pruinosus","Scissor Grinder",Iowa,Johnson,2022-07-23,22:24:47,"F. W. Kent Park",41.73491869,-91.72188289,"Jim Durbin",adult,Blacklight/Fluorescent,Photograph,1,88,65,74,12,190,29.81,cloudy,"40 % visible",
312331,,,,"Neotibicen pruinosus","Scissor Grinder",Iowa,Johnson,2022-07-23,22:20:02,"F. W. Kent Park",41.73491869,-91.72188289,"Jim Durbin",adult,Blacklight/Fluorescent,Photograph,1,88,65,74,12,190,29.81,cloudy,"40 % visible",
312333,,,,"Neotibicen pruinosus","Scissor Grinder",Iowa,Johnson,2022-07-23,22:19:09,"F. W. Kent Park",41.73491869,-91.72188289,"Jim Durbin",adult,Blacklight/Fluorescent,Photograph,1,88,65,74,12,190,29.81,cloudy,"40 % visible",
312431,,,,"Neotibicen pruinosus","Scissor Grinder",Iowa,Johnson,2022-07-23,21:35:01,"F. W. Kent Park",41.73491869,-91.72188289,"Jim Durbin",adult,Blacklight/Fluorescent,Pinned,1,88,65,74,12,190,29.81,cloudy,"40 % visible",
316230,,,,"Neotibicen pruinosus","Scissor Grinder",Iowa,Johnson,2012-08-10,,"Willow Creek/Kiwanis Park",41.647924,-91.569677,"Peter Hansen",adult,Sighting,Photograph,1,,,,,,,,,
316232,,,,"Neotibicen pruinosus","Scissor Grinder",Iowa,Johnson,2019-08-29,,"Willow Creek/Kiwanis Park",41.647924,-91.569677,"Peter Hansen",adult,Sighting,Photograph,1,,,,,,,,,
316264,,,,"Neotibicen pruinosus","Scissor Grinder",Iowa,Johnson,2011-08-19,,"Willow Creek/Kiwanis Park",41.647924,-91.569677,"Peter Hansen",adult,Sighting,Photograph,1,,,,,,,,,
331967,,,,"Neotibicen pruinosus","Scissor Grinder",Iowa,Johnson,2022-08-28,,Redacted,Redacted,Redacted,"Mark Brown",adult,Sighting,Photograph,1,,,,,,,,,
332181,,,,"Neotibicen pruinosus","Scissor Grinder",Iowa,Johnson,2022-08-24,22:32:00,Redacted,Redacted,Redacted,"Mark Brown",adult,Sighting,Photograph,1,,,,,,,,,
339251,,,,"Neotibicen pruinosus","Scissor Grinder",Iowa,Linn,2023-07-25,23:28:35,"1460 Douglas Ct, Marion",42.040078311667,-91.590925903333,"Jim Durbin",adult,Sighting,Photograph,1,,,,,,,,,
340475,,,,"Neotibicen pruinosus","Scissor Grinder",Iowa,Linn,2023-08-20,22:07:45,"Pinicon Ridge Park",42.21852826,-91.53878734,"Jim Durbin",adult,Blacklight/Fluorescent,Photograph,1,87,73,77,2,360,30.09,"partly cloudy","10% visible",
340556,,,,"Neotibicen pruinosus","Scissor Grinder",Iowa,Linn,2023-08-20,22:52:40,"Pinicon Ridge Park",42.21852826,-91.53878734,"Jim Durbin",adult,Blacklight/Fluorescent,Photograph,1,87,73,77,2,360,30.09,"partly cloudy","10% visible",
340950,,,,"Neotibicen pruinosus","Scissor Grinder",Iowa,Linn,2023-08-25,21:53:47,"Hitaga Sand Ridge Prairie Preserve",42.25093191,-91.63218534,"Jim Durbin",adult,Blacklight/Fluorescent,Photograph,1,81,72,71,5,345,29.93,clear,"60% visible",
340990,,,,"Neotibicen pruinosus","Scissor Grinder",Iowa,Linn,2023-08-25,22:06:58,"Hitaga Sand Ridge Prairie Preserve",42.25093191,-91.63218534,"Jim Durbin",adult,Blacklight/Fluorescent,Photograph,1,81,72,71,5,345,29.93,clear,"60% visible",
345302,,,,"Neotibicen pruinosus","Scissor Grinder",Iowa,Johnson,2023-07-26,06:12:52,"MacBride Nature Recreation Area",41.786887861667,-91.56850911,"Mark Brown",adult,Sighting,Photograph,1,,,,,,,,,
348262,,,,"Neotibicen pruinosus","Scissor Grinder",Iowa,Johnson,2023-08-24,06:10:20,"MacBride Nature Recreation Area",41.786616971667,-91.568449623333,"Mark Brown",adult,Sighting,Photograph,1,,,,,,,,,
