ID,"Collection / Source","Catalog Number","Specify Number",Taxon,"Common Name",State,County,Date,Time,Locale,Latitude,Longitude,Collector,"Life Stage","Collection Method","Preparation Type",Count,Temperature,Humidity,"Dew Point",Wind,"Wind Direction","Barometric Pressure",Sky,"Moon Phase",Notes
137926,,2016-002470,,"Arphia xanthoptera","Autumn Yellow-winged Grasshopper",Iowa,Polk,2012-09-02,,"Big Creek State Park",41.807055,-93.745185,"Mark Brown",adult,,Photograph,1,,,,,,,,,
229433,,2019-004146,,"Arphia xanthoptera","Autumn Yellow-winged Grasshopper",Iowa,Story,2016-08-28,,"Ada Hayden Heritage Park",42.06694,-93.62944,"Wolfgang Oesterreich",adult,,Photograph,1,,,,,,,,,
247285,,,,"Arphia xanthoptera","Autumn Yellow-winged Grasshopper",Iowa,Webster,2019-09-23,16:41:19,"Brushy Creek State Recreation Area",42.396474,-93.994196,"Mark Brown",adult,Sighting,Photograph,1,,,,,,,,,
319751,,,,"Arphia xanthoptera","Autumn Yellow-winged Grasshopper",Iowa,Plymouth,2022-08-21,,"Five Ridge Prairie State Preserve",42.679143,-96.523488,"Jay Gilliam",adult,Sighting,Photograph,1,,,,,,,,,
319984,,,,"Arphia xanthoptera","Autumn Yellow-winged Grasshopper",Iowa,Marion,2022-10-01,,"Roberts Creek Park",41.42076,-93.052121,"Jay Gilliam",adult,Sighting,Photograph,1,,,,,,,,,
319986,,,,"Arphia xanthoptera","Autumn Yellow-winged Grasshopper",Iowa,Marion,2022-10-08,,"Elk Rock State Park",41.40032,-93.060454,"Jay Gilliam",adult,Sighting,Photograph,1,,,,,,,,,
357929,,,,"Arphia xanthoptera","Autumn Yellow-winged Grasshopper",Iowa,Jasper,1997-10-11,,"Neal Smith National Wildlife Refuge",41.5678,-93.2675,"Kirk J. Larsen",adult,,,1,,,,,,,,,"Data from Kirk Larsen, Luther College"
357930,,,,"Arphia xanthoptera","Autumn Yellow-winged Grasshopper",Iowa,Jasper,1997-10-11,,"Neal Smith National Wildlife Refuge",41.5678,-93.2675,"Kirk J. Larsen",adult,,,1,,,,,,,,,"Data from Kirk Larsen, Luther College"
