ID,"Collection / Source","Catalog Number","Specify Number",Taxon,"Common Name",State,County,Date,Time,Locale,Latitude,Longitude,Collector,"Life Stage","Collection Method","Preparation Type",Count,Temperature,Humidity,"Dew Point",Wind,"Wind Direction","Barometric Pressure",Sky,"Moon Phase",Notes
11461,,2014-011743,SPM035525,"Rhagoletis suavis","Walnut Husk Maggot",Iowa,Jones,2013-07-31,,"Wapsipinicon State Park",42.09038,-91.2861,"Jim Durbin",adult,Blacklight/Fluorescent,Photograph,1,,,,,,,,,
144789,,2016-009411,,"Eutreta noveboracensis",None,Iowa,Iowa,2011-07-24,,"Amana Woods Nature Trail",41.76528,-91.87667,"Mark Brown",adult,,Photograph,1,,,,,,,,,
144861,,2016-009483,,"Paracantha culta",None,Iowa,Johnson,2014-06-20,,Redacted,Redacted,Redacted,"Mark Brown",adult,,Photograph,1,,,,,,,,,
144873,,2016-009495,,"Rhagoletis pomonella",None,Iowa,Polk,2013-09-02,,"Carney Marsh Nature Preserve",41.688625,-93.593193,"Mark Brown",adult,,Photograph,1,,,,,,,,,
144876,,2016-009498,,"Euaresta bella",None,Iowa,Polk,2015-08-16,,"Big Creek State Park",41.807055,-93.745185,"Mark Brown",adult,,Photograph,1,,,,,,,,,
144893,,2016-009515,,"Euaresta bella",None,Iowa,Johnson,2013-07-13,,"Ciha Fen Wildlife Preserve",41.82917,-91.38278,"Mark Brown",adult,,Photograph,1,,,,,,,,,
144907,,2016-009529,,"Paracantha culta",None,Iowa,Webster,2012-06-10,,"Bob Hay Memorial Conservation Area",42.4887,-94.2371,"Mark Brown",adult,,Photograph,1,,,,,,,,,
144911,,2016-009533,,"Rhagoletis suavis","Walnut Husk Maggot",Iowa,Webster,2012-06-09,,"Dolliver Memorial State Park",42.3893,-94.0805,"Mark Brown",adult,,Photograph,1,,,,,,,,,
145777,,2016-010404,,"Strauzia noctipennis",None,Iowa,Allamakee,2015-05-06,,Redacted,Redacted,Redacted,"MJ Hatfield",adult,,Photograph,1,,,,,,,,,
147129,,2016-011756,,"Rhagoletis suavis","Walnut Husk Maggot",Iowa,Winneshiek,2010-08-16,,"100 Acre Wood-x",0,0,"MJ Hatfield",adult,,Photograph,1,,,,,,,,,
147139,,2016-011766,,"Strauzia noctipennis",None,Iowa,Winneshiek,2010-05-23,,"Plymouth Rock-x",0,0,"MJ Hatfield",adult,,Photograph,1,,,,,,,,,
147288,,2016-011915,,"Xanthomyia platyptera",None,Iowa,Winneshiek,2012-09-11,,"Plymouth Rock-x",0,0,"MJ Hatfield",adult,,Photograph,1,,,,,,,,,
147404,,2016-012031,,"Neotephritis finalis","Sunflower Seed Maggot",Iowa,Winneshiek,2013-09-15,,"Plymouth Rock-x",0,0,"MJ Hatfield",adult,,Photograph,1,,,,,,,,,
147424,,2016-012051,,"Eurosta solidaginis","Goldenrod Gall Fly",Iowa,Winneshiek,2012-04-27,,"Plymouth Rock-x",0,0,"MJ Hatfield",adult,,Photograph,1,,,,,,,,,
147542,,2016-012169,,"Strauzia noctipennis",None,Iowa,Winneshiek,2015-06-12,,"Plymouth Rock-x",0,0,"MJ Hatfield",adult,,Photograph,1,,,,,,,,,
147544,,2016-012171,,"Strauzia noctipennis",None,Iowa,Winneshiek,2015-06-12,,"Plymouth Rock-x",0,0,"MJ Hatfield",adult,,Photograph,1,,,,,,,,,
147545,,2016-012172,,"Strauzia noctipennis",None,Iowa,Winneshiek,2015-06-12,,"Plymouth Rock-x",0,0,"MJ Hatfield",adult,,Photograph,1,,,,,,,,,
147547,,2016-012174,,"Strauzia arculata",None,Iowa,Winneshiek,2015-06-12,,"Plymouth Rock-x",0,0,"MJ Hatfield",adult,,Photograph,1,,,,,,,,,
168098,,2016-032843,,"Strauzia noctipennis",None,Iowa,Linn,2016-05-31,1030-2300,"Hitaga Sand Ridge Prairie Preserve",42.250957,-91.632098,"Jim Durbin",adult,Blacklight/Florescent,Photograph,1,66,100,65,0,0,29.89,cloudy,"30% visible","1030-2300. Rained for about 45 minutes."
168154,,2016-032899,,"Eutreta noveboracensis",None,Iowa,Linn,2016-05-31,1030-2300,"Hitaga Sand Ridge Prairie Preserve",42.250957,-91.632098,"Jim Durbin",adult,Blacklight/Florescent,Photograph,1,66,100,65,0,0,29.89,cloudy,"30% visible","1030-2300. Rained for about 45 minutes."
172733,,2016-037478,,"Rhagoletis suavis","Walnut Husk Maggot",Iowa,Linn,2016-07-24,,"Hitaga Sand Ridge Prairie Preserve",42.250957,-91.632098,"Jim Durbin",adult,Blacklight/Fluorescent,Photograph,1,77,70,66,,300,29.9,"partly cloudy","90% visible",
172815,,2016-037560,,"Rhagoletis suavis","Walnut Husk Maggot",Iowa,Linn,2016-07-24,,"Hitaga Sand Ridge Prairie Preserve",42.250957,-91.632098,"Jim Durbin",adult,Blacklight/Fluorescent,Photograph,1,77,70,66,,300,29.9,"partly cloudy","90% visible",
176369,,2016-041119,,"Procecidochares atra",None,Iowa,Linn,2016-09-11,2000-2200,"Hitaga Sand Ridge Prairie Preserve",42.250957,-91.632098,"Jim Durbin",adult,Blacklight/Fluorescent,Photograph,1,76,40,50,5,120,29.99,clear,"80% visible",
176449,,2016-041199,,"Procecidochares atra",None,Iowa,Linn,2016-09-11,2000-2200,"Hitaga Sand Ridge Prairie Preserve",42.250957,-91.632098,"Jim Durbin",adult,Blacklight/Fluorescent,Photograph,1,76,40,50,5,120,29.99,clear,"80% visible",
181708,,2016-046345,,"Rhagoletis cingulata","Eastern Cherry Fruit Fly",Iowa,Johnson,2016-07-31,,"North Liberty",41.747721,-91.61648,"Mark Brown",adult,Sighting,Photograph,1,,,,,,,,,
181719,,2016-046358,,"Trupanea actinobola",None,Iowa,Johnson,2016-07-29,,Redacted,Redacted,Redacted,"Mark Brown",adult,,Photograph,1,,,,,,,,,
181724,,2016-046363,,"Tomoplagia cressoni",None,Iowa,Johnson,2016-07-24,,Redacted,Redacted,Redacted,"Mark Brown",adult,,Photograph,1,,,,,,,,,
181799,,2016-046491,,"Urophora cardui","Canada Thistle Stem Gall Fly",Iowa,Floyd,2016-06-26,,"Stricker Fen",43.197398,-92.693691,"Mark Brown",adult,,Photograph,1,,,,,,,,,
181937,,2016-046685,,"Euaresta aequalis",None,Iowa,Polk,2016-08-07,,"Red Feather Prairie",41.715097,-93.6734342,"Mark Brown",adult,,Photograph,1,,,,,,,,,
181939,,2016-046687,,"Euaresta aequalis",None,Iowa,Polk,2016-08-07,,"Red Feather Prairie",41.715097,-93.6734342,"Mark Brown",adult,,Photograph,1,,,,,,,,,
181985,,2016-046733,,"Paracantha culta",None,Iowa,Pottawattamie,2016-08-13,,"Folsom Point Preserve",41.16139,-95.795,"Mark Brown",adult,,Photograph,1,,,,,,,,,
182031,,2016-046779,,"Paracantha culta",None,Iowa,Pottawattamie,2016-08-15,,"Hitchcock Nature Center",41.41733,-95.85388,"Mark Brown",adult,,Photograph,1,,,,,,,,,
182779,,2017-000740,,"Procecidochares atra",None,Iowa,Winneshiek,2016-08-24,,"100 Acre Wood-x",0,0,"MJ Hatfield",adult,,Photograph,1,,,,,,,,,
192856,,2017-010820,,"Euaresta bella",None,Iowa,Linn,2017-06-24,2045-2300,"Hitaga Sand Ridge Prairie Preserve",42.250957,-91.632098,"Jim Durbin",adult,Blacklight/Fluorescent,Photograph,1,65,43,46,13,280,30.14,clear,new,
194589,,2017-012554,,"Rhagoletis suavis","Walnut Husk Maggot",Iowa,Linn,2017-07-29,2045-2315,"Hitaga Sand Ridge Prairie Preserve",42.250957,-91.632098,"Jim Durbin",adult,Blacklight/Fluorescent,Photograph,1,69,73,61,0,0,30.09,clear,"40% visible",
194622,,2017-012587,,"Rhagoletis suavis","Walnut Husk Maggot",Iowa,Linn,2017-07-29,2045-2315,"Hitaga Sand Ridge Prairie Preserve",42.250957,-91.632098,"Jim Durbin",adult,Blacklight/Fluorescent,Photograph,1,69,73,61,0,0,30.09,clear,"40% visible",
194624,,2017-012589,,"Rhagoletis suavis","Walnut Husk Maggot",Iowa,Linn,2017-07-29,2045-2315,"Hitaga Sand Ridge Prairie Preserve",42.250957,-91.632098,"Jim Durbin",adult,Blacklight/Fluorescent,Photograph,1,69,73,61,0,0,30.09,clear,"40% visible",
195374,,2017-013338,,"Rhagoletis suavis","Walnut Husk Maggot",Iowa,Linn,2017-08-14,2030-2300,"Hitaga Sand Ridge Prairie Preserve",42.250957,-91.632098,"Jim Durbin",adult,Blacklight/Fluorescent,Photograph,1,72,97,71,0,0,29.81,clear,"60% visible",
196183,,2017-014147,,"Rhagoletis suavis","Walnut Husk Maggot",Iowa,Linn,2017-08-30,2000-2300,"Hitaga Sand Ridge Prairie Preserve",42.250957,-91.632098,"Jim Durbin",adult,Blacklight/Fluorescent,Photograph,1,70,90,68,0,0,30.07,clear,"50% visible",
213508,,2018-011664,,"Rhagoletis suavis","Walnut Husk Maggot",Iowa,Linn,2018-06-27,2100-2330,"Matsell Bridge Natural Area",42.132148,-91.385221,"Jim Durbin",adult,Blacklight/Fluorescent,Photograph,1,80,59,64,0,0,29.77,"partly cloudy",Full,"extremely heavy dew"
214579,,2018-012735,,"Rhagoletis suavis","Walnut Husk Maggot",Iowa,Linn,2018-07-12,2100-2330,"Matsell Bridge Natural Area",42.132148,-91.385221,"Jim Durbin",adult,Blacklight/Fluorescent,Photograph,1,88,56,70,6,90,30.04,clear,"0 visible",
214584,,2018-012740,,"Rhagoletis suavis","Walnut Husk Maggot",Iowa,Linn,2018-07-12,2100-2330,"Matsell Bridge Natural Area",42.132148,-91.385221,"Jim Durbin",adult,Blacklight/Fluorescent,Photograph,1,88,56,70,6,90,30.04,clear,"0 visible",
214604,,2018-012760,,"Rhagoletis suavis","Walnut Husk Maggot",Iowa,Linn,2018-07-12,2100-2330,"Matsell Bridge Natural Area",42.132148,-91.385221,"Jim Durbin",adult,Blacklight/Fluorescent,Photograph,1,88,56,70,6,90,30.04,clear,"0 visible",
214605,,2018-012761,,"Rhagoletis suavis","Walnut Husk Maggot",Iowa,Linn,2018-07-12,2100-2330,"Matsell Bridge Natural Area",42.132148,-91.385221,"Jim Durbin",adult,Blacklight/Fluorescent,Photograph,1,88,56,70,6,90,30.04,clear,"0 visible",
216235,,2018-014391,,"Rhagoletis suavis","Walnut Husk Maggot",Iowa,Linn,2018-07-23,2100-2300,"Hitaga Sand Ridge Prairie Preserve",42.250957,-91.632098,"Jim Durbin",adult,Blacklight/Fluorescent,Photograph,1,78,62,64,1,275,29.98,clear,"80% visible",
219527,,2018-017683,,"Rhagoletis suavis","Walnut Husk Maggot",Iowa,Linn,2018-08-25,2015-2300,"Hitaga Sand Ridge Prairie Preserve",42.250604,-91.629962,"Jim Durbin",adult,Blacklight/Fluorescent,Photograph,1,74,97,73,3,310,29.91,cdlear,"Full Moon",
225483,,2019-000419,,"Zonosemata electa","Pepper Maggot",Iowa,Johnson,2018-07-08,,"Hawkeye Willdlife Management Area",41.772046,-91.715148,"Mark Brown",adult,,Photograph,1,,,,,,,,,
225594,,2019-000506,,"Rhagoletis suavis","Walnut Husk Maggot",Iowa,Polk,2018-08-12,,"Saylorville Visitor Center",41.707482,-93.671472,"Mark Brown",adult,,Photograph,1,,,,,,,,,
229984,,2019-004698,,"Rhagoletis suavis","Walnut Husk Maggot",Iowa,Jefferson,2018-07-25,,"Jefferson County Park",40.98639,-91.99111,"Moni Hayne",adult,,Photograph,1,,,,,,,,,
234736,,,,"Rhagoletis suavis","Walnut Husk Maggot",Iowa,Linn,2019-07-29,2100-2315,"Wickiup Hill Outdoor Learning Area",42.087352,-91.767107,"Jim Durbin",adult,Blacklight/Fluorescent,Photograph,1,74,58,59,3,270,29.9,clear,"10% visible",
235131,,,,"Rhagoletis suavis","Walnut Husk Maggot",Iowa,Linn,2019-08-02,2100-2315,"Hitaga Sand Ridge Prairie Preserve",42.251284,-91.630087,"Jim Durbin",adult,Sighting,Photograph,1,70,67,58,1,90,30.02,clar,dark,
235200,,,,"Rhagoletis suavis","Walnut Husk Maggot",Iowa,Linn,2019-08-02,2100-2315,"Hitaga Sand Ridge Prairie Preserve",42.251284,-91.630087,"Jim Durbin",adult,Sighting,Photograph,1,70,67,58,1,90,30.02,clar,dark,
235223,,,,"Rhagoletis suavis","Walnut Husk Maggot",Iowa,Linn,2019-08-02,2100-2315,"Hitaga Sand Ridge Prairie Preserve",42.251284,-91.630087,"Jim Durbin",adult,Sighting,Photograph,1,70,67,58,1,90,30.02,clar,dark,
235543,,,,"Rhagoletis suavis","Walnut Husk Maggot",Iowa,Linn,2019-08-08,2030-2315,"Pleasant Creek State Recreation Area, Linn County",42.109891,-91.826883,"Jim Durbin",adult,Blacklight/Fluorescent,Photograph,1,73,54,55,0,0,29.86,clear,"40% visible",
237208,,,,"Euaresta aequalis",None,Iowa,Johnson,2019-08-20,,Redacted,Redacted,Redacted,"Mark Brown",adult,Sighting,Photograph,1,,,,,,,,,
237534,,,,"Euaresta bella",None,Iowa,Allamakee,2019-09-14,19:05:42,Redacted,Redacted,Redacted,"Jeff Abbas",adult,Sighting,Photograph,1,,,,,,,,,
237659,,,,"Rhagoletis suavis","Walnut Husk Maggot",Iowa,Linn,2019-08-24,2030-2300,"Hitaga Sand Ridge Prairie Preserve",42.250957,-91.632098,"Jim Durbin",adult,Blacklight/Fluorescent,Photograph,1,65,71,56,2,90,30.01,"partly cloudy","50% visible",
238342,,,,"Rhagoletis suavis","Walnut Husk Maggot",Iowa,Johnson,2019-09-02,,"MacBride Nature Recreation Area",41.786729,-91.568057,"Mark Brown",adult,Sighting,Photograph,1,,,,,,,,,
238672,,,,"Rhagoletis suavis","Walnut Husk Maggot",Iowa,Linn,2019-09-30,1915-2200,"Hitaga Sand Ridge Prairie Preserve",42.250957,-91.632098,"Jim Durbin",adult,Blacklight/Fluorescent,Photograph,1,81,67,69,13,185,29.64,Clear,"0% visible",
247309,,,,"Rhagoletis suavis","Walnut Husk Maggot",Iowa,Johnson,2019-09-03,18:18:15,"MacBride Nature Recreation Area",41.785388,-91.560843,"Mark Brown",adult,Sighting,Photograph,1,,,,,,,,,
265429,,,,"Strauzia longipennis","Sunflower Maggot",Iowa,Linn,2020-06-05,22:21:10,"Hitaga Sand Ridge Prairie Preserve",42.25088607,-91.63212362,"Jim Durbin",adult,Blacklight/Fluorescent,Photograph,1,75,58,59,4,355,29.95,clear,Full,
267342,,,,"Strauzia perfecta",None,Iowa,Allamakee,2020-06-20,20:04:22,Redacted,Redacted,Redacted,"Jeff Abbas",adult,Sighting,Photograph,1,78,77,,,,,Rainy,,
267473,,,,"Xanthomyia platyptera",None,Iowa,Wapello,2020-05-29,,"Eddyville Sand Prairie Park",41.154822,-92.616784,"Mark Brown",adult,Sighting,Photograph,1,,,,,,,,,
268696,,,,"Rhagoletis suavis","Walnut Husk Maggot",Iowa,Linn,2020-07-20,2100,"Hitaga Sand Ridge Prairie Preserve",42.250928,-91.63211,"Jim Durbin",adult,Blacklight/Fluorescent,Photograph,1,71,75,63,3,110,29.61,clear,new,
268835,,,,"Rhagoletis suavis","Walnut Husk Maggot",Iowa,Linn,2020-07-24,22:12:04,"Wickiup Hill Outdoor Learning Area",42.08807239,-91.76755076,"Jim Durbin",adult,Blacklight/Fluorescent,Photograph,1,80,76,72,4,120,29.6,clear,"20% visible",
268836,,,,"Rhagoletis suavis","Walnut Husk Maggot",Iowa,Linn,2020-07-24,22:12:04,"Wickiup Hill Outdoor Learning Area",42.08807239,-91.76755076,"Jim Durbin",adult,Blacklight/Fluorescent,Photograph,1,80,76,72,4,120,29.6,clear,"20% visible",
274962,,,,"Procecidochares atra",None,Iowa,Johnson,2020-06-13,,"Schwab-Buford Preserve",41.753178,-91.534916,"Mark Brown",adult,Sighting,Photograph,2,,,,,,,,,
277952,,,,"Strauzia longipennis","Sunflower Maggot",Iowa,Johnson,2020-06-28,,"F. W. Kent Park",41.735646,-91.722956,"Mark Brown",adult,"Building Light",Photograph,1,,,,,,,,,
277971,,,,"Eutreta noveboracensis",None,Iowa,Johnson,2020-06-28,,"F. W. Kent Park",41.735646,-91.722956,"Mark Brown",adult,"Building Light",Photograph,1,,,,,,,,,
277987,,,,"Euaresta bella",None,Iowa,Johnson,2020-06-28,,"Ciha Fen Wildlife Preserve",41.82936755,-91.38111631,"Mark Brown",adult,Sighting,Photograph,1,,,,,,,,,
282274,,,,"Euaresta festiva",None,Iowa,Johnson,2020-08-12,,Redacted,Redacted,Redacted,"Mark Brown",adult,Sighting,Photograph,1,,,,,,,,,
287104,,,,"Euaresta aequalis",None,Iowa,Jefferson,2018-08-12,20:13:07,Fairfield,41.01280899,-91.96219588,"Moni Hayne",adult,Blacklight/Fluorescent,Pinned,1,,,,,,,,,
291760,,,,"Rhagoletis suavis","Walnut Husk Maggot",Iowa,Linn,2021-08-11,21:42:12,"Pleasant Creek State Recreation Area, Linn County",42.11043641,-91.82716239,"Jim Durbin",adult,Blacklight/Fluorescent,Photograph,1,84,66,72,6,270,29.66,"partly cloudy","10% visible",
291827,,,,"Rhagoletis suavis","Walnut Husk Maggot",Iowa,Linn,2021-08-11,21:04:08,"Pleasant Creek State Recreation Area, Linn County",42.11043641,-91.82716239,"Jim Durbin",adult,Blacklight/Fluorescent,Photograph,1,84,66,72,6,270,29.66,"partly cloudy","10% visible",
295374,,,,"Euaresta bella",None,Iowa,Johnson,2021-07-05,9:51:56,"Ciha Fen Wildlife Preserve",41.82927896,-91.38156991,"Mark Brown",adult,Sighting,Photograph,1,,,,,,,,,
296581,,,,"Rhagoletis suavis","Walnut Husk Maggot",Iowa,Johnson,2021-08-21,6:57:24,"MacBride Nature Recreation Area",41.78675752,-91.56846026,"Mark Brown",adult,Sighting,Photograph,1,,,,,,,,,
296795,,,,"Eutreta noveboracensis",None,Iowa,Johnson,2021-08-08,9:34:55,"Reif Reilly Fen and Prairie",41.83084749,-91.48901002,"Mark Brown",adult,Sighting,Photograph,1,,,,,,,,,
297876,,,,"Strauzia longipennis","Sunflower Maggot",Iowa,Johnson,2021-07-04,,"Lake MacBride State Park",41.803491,-91.569486,"Mark Brown",adult,Sighting,Photograph,1,,,,,,,,,
297927,,,,"Eutreta noveboracensis",None,Iowa,Webster,2021-07-11,,"Dolliver Memorial State Park",42.384689,-94.085501,"Mark Brown",adult,Sighting,Photograph,1,,,,,,,,,
297992,,,,"Rhagoletis suavis","Walnut Husk Maggot",Iowa,Linn,2021-07-24,,"Hitaga Sand Ridge Prairie Preserve",42.250856,-91.633802,"Mark Brown",adult,Sighting,Photograph,1,,,,,,,,,
297997,,,,"Euaresta bella",None,Iowa,Linn,2021-07-24,,"Hitaga Sand Ridge Prairie Preserve",42.250856,-91.633802,"Mark Brown",adult,Sighting,Photograph,1,,,,,,,,,
298240,,,,"Euaresta bella",None,Iowa,Johnson,2021-08-08,,"Reif Reilly Fen and Prairie",41.830951,-91.48912,"Mark Brown",adult,Sighting,Photograph,1,,,,,,,,,
298267,,,,"Icterica seriata",None,Iowa,Johnson,2021-08-11,,Redacted,Redacted,Redacted,"Mark Brown",adult,Sighting,Photograph,1,,,,,,,,,
298301,,,,"Euaresta aequalis",None,Iowa,"Des Moines",2021-08-21,,"Starr's Cave Nature Center",40.849735,-91.135808,"Mark Brown",adult,Sighting,Photograph,1,,,,,,,,,
299015,,,,"Euaresta festiva",None,Iowa,Johnson,2021-10-09,,Redacted,Redacted,Redacted,"Mark Brown",adult,"Building Light",Photograph,1,,,,,,,,,
310982,,,,"Rhagoletis suavis","Walnut Husk Maggot",Iowa,Linn,2022-06-28,22:45:21,"Hitaga Sand Ridge Prairie Preserve",42.2510735,-91.63217209,"Jim Durbin",adult,Blacklight/Fluorescent,Photograph,1,75,50,56,6,270,30.04,"partly cloudy","new moon",
312595,,,,"Rhagoletis suavis","Walnut Husk Maggot",Iowa,Linn,2022-07-26,22:23:29,"Hitaga Sand Ridge Prairie Preserve",42.25103779,-91.63215575,"Jim Durbin",adult,Blacklight/Fluorescent,Photograph,1,76,79,69,1,170,29.91,cloudy,"10% moon",
312629,,,,"Rhagoletis suavis","Walnut Husk Maggot",Iowa,Linn,2022-07-26,22:11:33,"Hitaga Sand Ridge Prairie Preserve",42.25103779,-91.63215575,"Jim Durbin",adult,Blacklight/Fluorescent,Photograph,1,76,79,69,1,170,29.91,cloudy,"10% moon",
312635,,,,"Rhagoletis suavis","Walnut Husk Maggot",Iowa,Linn,2022-07-26,22:10:35,"Hitaga Sand Ridge Prairie Preserve",42.25103779,-91.63215575,"Jim Durbin",adult,Blacklight/Fluorescent,Photograph,1,76,79,69,1,170,29.91,cloudy,"10% moon",
312671,,,,"Rhagoletis suavis","Walnut Husk Maggot",Iowa,Linn,2022-07-26,21:44:54,"Hitaga Sand Ridge Prairie Preserve",42.25103779,-91.63215575,"Jim Durbin",adult,Blacklight/Fluorescent,Photograph,1,76,79,69,1,170,29.91,cloudy,"10% moon",
312842,,,,"Rhagoletis suavis","Walnut Husk Maggot",Iowa,Linn,2022-07-31,22:05:01,"Pinicon Ridge Park",42.21080865,-91.54426907,"Jim Durbin",adult,Sighting,Photograph,1,77,82,71,2,270,29.9,"mostly cloudy","10% visible",
314709,,,,"Rhagoletis suavis","Walnut Husk Maggot",Iowa,Linn,2022-09-15,21:41:00,"Matsell Bridge Natural Area",42.13206715,-91.38532979,"Jim Durbin",adult,Blacklight/Fluorescent,Photograph,1,80,54,64,3,180,30.05,"partly cloudy","90% visible",
314759,,,,"Rhagoletis suavis","Walnut Husk Maggot",Iowa,Linn,2022-09-15,20:39:32,"Matsell Bridge Natural Area",42.13206715,-91.38532979,"Jim Durbin",adult,Blacklight/Fluorescent,Photograph,1,80,54,64,3,180,30.05,"partly cloudy","90% visible",
315864,,,,"Rhagoletotrypeta rohweri",None,Iowa,Johnson,2022-08-23,8:50,"Willow Creek/Kiwanis Park",41.644832,-91.568628,"Peter Hansen",adult,Sighting,Photograph,1,,,,,,,,,"The insect was observed in Kiwanis Park on one of about 20 Iowa City Public Library displays located next to the trail.  The surface was probably Plexiglass although it could have been glass.
Confirmed by comparison to: https://bugguide.net/node/view/763824"
316380,,,,"Euaresta bella",None,Iowa,Johnson,2022-07-02,8:13:26,"Ciha Fen Wildlife Preserve",41.82929959,-91.38152937,"Mark Brown",adult,Sighting,Photograph,1,,,,,,,,,
317702,,,,"Rhagoletis cingulata","Eastern Cherry Fruit Fly",Iowa,Johnson,2022-07-06,,"MacBride Nature Recreation Area",41.787042,-91.568518,"Mark Brown",adult,Sighting,Photograph,1,,,,,,,,,
320197,,,,"Rhagoletis cingulata","Eastern Cherry Fruit Fly",Iowa,Johnson,2022-07-10,6:23:29,"MacBride Nature Recreation Area",41.78687225,-91.56846254,"Mark Brown",adult,Sighting,Photograph,1,,,,,,,,,
320337,,,,"Rhagoletis suavis","Walnut Husk Maggot",Iowa,Johnson,2022-07-15,6:22:23,"MacBride Nature Recreation Area",41.7868507,-91.56854348,"Mark Brown",adult,Sighting,Photograph,1,,,,,,,,,
320760,,,,"Rhagoletis suavis","Walnut Husk Maggot",Iowa,Johnson,2022-07-19,6:11:34,"MacBride Nature Recreation Area",41.7869394,-91.5684859,"Mark Brown",adult,Sighting,Photograph,1,,,,,,,,,
331896,,,,"Procecidocharoides penelope",None,Iowa,Johnson,2022-08-14,,"F. W. Kent Park",41.726182,-91.733289,"Mark Brown",adult,Sighting,Photograph,1,,,,,,,,,
331900,,,,"Euaresta festiva",None,Iowa,Johnson,2022-08-14,,"F. W. Kent Park",41.726182,-91.733289,"Mark Brown",adult,Sighting,Photograph,1,,,,,,,,,
332858,,,,"Euaresta bella",None,Iowa,Johnson,2022-08-14,17:36:35,"F. W. Kent Park",41.735847238333335,-91.723220845,"Mark Brown",adult,Sighting,Photograph,1,,,,,,,,,
332893,,,,"Rhagoletis suavis","Walnut Husk Maggot",Iowa,Linn,2022-08-13,09:23:54,"Hitaga Sand Ridge Prairie Preserve",42.25056046666667,-91.633314525,"Mark Brown",adult,Sighting,Photograph,1,,,,,,,,,
338708,,,,"Rhagoletis suavis","Walnut Husk Maggot",Iowa,Linn,2023-07-25,22:26:34,"Pinicon Ridge Park",42.2108105,-91.54420598,"Jim Durbin",adult,Blacklight/Fluorescent,Photograph,1,85,71,75,4,110,29.8,"partly cloudy","40 % visible",
338732,,,,"Rhagoletis suavis","Walnut Husk Maggot",Iowa,Linn,2023-07-25,22:50:52,"Pinicon Ridge Park",42.2108105,-91.54420598,"Jim Durbin",adult,Blacklight/Fluorescent,Photograph,1,85,71,75,4,110,29.8,"partly cloudy","40 % visible",
339364,,,,"Rhagoletis suavis","Walnut Husk Maggot",Iowa,Linn,2023-08-05,21:13:49,"Pleasant Creek State Recreation Area, Linn County",42.11005504,-91.82770624,"Jim Durbin",adult,Blacklight/Fluorescent,Photograph,1,76,78,69,3,90,29.93,"partly cloudy","50% moon",
339412,,,,"Rhagoletis suavis","Walnut Husk Maggot",Iowa,Linn,2023-08-05,22:09:32,"Pleasant Creek State Recreation Area, Linn County",42.11005504,-91.82770624,"Jim Durbin",adult,Blacklight/Fluorescent,Photograph,1,76,78,69,3,90,29.93,"partly cloudy","50% moon",
339420,,,,"Rhagoletis suavis","Walnut Husk Maggot",Iowa,Linn,2023-08-05,22:12:46,"Pleasant Creek State Recreation Area, Linn County",42.11005504,-91.82770624,"Jim Durbin",adult,Blacklight/Fluorescent,Photograph,1,76,78,69,3,90,29.93,"partly cloudy","50% moon",
339422,,,,"Rhagoletis suavis","Walnut Husk Maggot",Iowa,Linn,2023-08-05,22:15:23,"Pleasant Creek State Recreation Area, Linn County",42.11005504,-91.82770624,"Jim Durbin",adult,Blacklight/Fluorescent,Photograph,1,76,78,69,3,90,29.93,"partly cloudy","50% moon",
340184,,,,"Rhagoletis suavis","Walnut Husk Maggot",Iowa,Linn,2023-08-15,21:07:04,"Matsell Bridge Natural Area",42.13218339,-91.38536314,"Jim Durbin",adult,Blacklight/Fluorescent,Photograph,1,67,87,63,1,330,30.04,clear,,
340252,,,,"Rhagoletis suavis","Walnut Husk Maggot",Iowa,Linn,2023-08-15,22:25:25,"Matsell Bridge Natural Area",42.13218339,-91.38536314,"Jim Durbin",adult,Blacklight/Fluorescent,Photograph,1,67,87,63,1,330,30.04,clear,,
341431,,,,"Rhagoletis suavis","Walnut Husk Maggot",Iowa,Linn,2023-09-05,22:12:57,"Wanatee County Park",42.010077715,-91.566528441667,"Jim Durbin",adult,Blacklight/Fluorescent,Photograph,1,84,63,70,13,180,29.73,cloudy,"80% moon",
341759,,,,"Rhagoletis cingulata","Eastern Cherry Fruit Fly",Iowa,Linn,2023-09-29,20:14:58,"Hitaga Sand Ridge Prairie Preserve",42.250745948333,-91.632190941667,"Jim Durbin",adult,Blacklight/Fluorescent,Photograph,1,78,75,65,9,160,30.03,clear,,
342769,,,,"Strauzia longipennis","Sunflower Maggot",Iowa,Webster,2023-07-02,,"Brushy Creek State Recreation Area",42.387084,-93.97563,"Mark Brown",adult,Sighting,Photograph,1,,,,,,,,,
343431,,,,"Eutreta noveboracensis",None,Iowa,Johnson,2023-07-04,10:30:31,"Ciha Fen Wildlife Preserve",41.829352,-91.381392,"Mark Brown",adult,Sighting,Photograph,1,,,,,,,,,
343608,,,,"Euaresta festiva",None,Iowa,Johnson,2023-07-04,07:21:16,"Ciha Fen Wildlife Preserve",41.829264615,-91.382295668333,"Mark Brown",adult,Sighting,Photograph,1,,,,,,,,,
344831,,,,"Euaresta festiva",None,Iowa,Madison,2023-08-13,,"Pammel State Park",41.294986,-94.074903,"Jay Gilliam",adult,Sighting,Photograph,1,,,,,,,,,
344873,,,,"Euaresta festiva",None,Iowa,Wright,2023-08-26,,"Big Wall Lake Wildlife Management Area",42.626904,-93.651943,"Jay Gilliam",adult,Sighting,Photograph,1,,,,,,,,,
345246,,,,"Euaresta festiva",None,Iowa,Polk,2023-07-29,09:01:28,"Jester Park",41.780774696667,-93.77080688,"Mark Brown",adult,Sighting,Photograph,1,,,,,,,,,