ID,"Collection / Source","Catalog Number","Specify Number",Taxon,"Common Name",State,County,Date,Time,Locale,Latitude,Longitude,Collector,"Life Stage","Collection Method","Preparation Type",Count,Temperature,Humidity,"Dew Point",Wind,"Wind Direction","Barometric Pressure",Sky,"Moon Phase",Notes
35178,"Jim Durbin Drawer 311-17",2014-035551,SPM006747,"Macrodactylus angustatus",None,Iowa,Linn,2006-07-14,,"Pleasant Creek State Recreation Area, Linn County",42.11952,-91.81215,"Jim Durbin",adult,Blacklight/Fluorescent,Pinned,1,,,,,,,,,
35179,"Jim Durbin Drawer 311-17",2014-035552,SPM006796,"Macrodactylus angustatus",None,Iowa,Linn,2006-07-16,,"Pleasant Creek State Recreation Area, Linn County",42.11952,-91.81215,"Jim Durbin",adult,Blacklight/Fluorescent,Pinned,1,,,,,,,,,
35180,"Jim Durbin Drawer 311-17",2014-035553,SPM006916,"Macrodactylus angustatus",None,Iowa,Lee,2006-07-22,,"Shimek State Forest, Croton Unit East",40.54693,-91.61435,"Jim Durbin",adult,Blacklight/Fluorescent,Pinned,1,,,,,,,,,
35181,"Jim Durbin Drawer 311-17",2014-035554,SPM006917,"Macrodactylus angustatus",None,Iowa,Lee,2006-07-22,,"Shimek State Forest, Croton Unit East",40.54693,-91.61435,"Jim Durbin",adult,Blacklight/Fluorescent,Pinned,1,,,,,,,,,
45072,"Jim Durbin Drawer 311-17",2014-045449,SPM004377,"Macrodactylus angustatus",None,Kentucky,Ohio,2005-06-06,,"Leon's Farm, Ohio County",37.42033,-86.77023,"Jim Durbin",adult,Blacklight/Fluorescent,Pinned,1,,,,,,,,,
45085,"Jim Durbin Drawer 311-17",2014-045462,SPM017824,"Macrodactylus angustatus",None,Kentucky,Ohio,2010-06-16,,"Leon's Farm, Ohio County",37.42033,-86.77023,"Jim Durbin",adult,Blacklight,Pinned,1,,,,,,,,,
45088,,2014-045465,SPM019653,"Macrodactylus angustatus",None,Kentucky,Ohio,2010-05-01,,Redacted,Redacted,Redacted,"Jourdan Yeckering",adult,,Pinned,1,,,,,,,,,
45093,,2014-045470,SPM022930,"Macrodactylus angustatus",None,Iowa,Linn,2011-07-10,,"Wickiup Hill Outdoor Learning Area",42.08398,-91.7651,"Jim Durbin",adult,Blacklight/Fluorescent,Photograph,1,,,,,,,,,
49863,,2014-050244,,"Macrodactylus angustatus",None,Iowa,Linn,2014-08-13,,"Pleasant Creek State Recreation Area, Linn County",42.110327,-91.822988,"Jim Durbin",adult,Blacklight/Fluorescent,Photograph,1,,,,,,,,,
69063,,2014-069670,,"Macrodactylus subspinosus","Rose Chafer",Iowa,Allamakee,2009-06-19,,"Heritage Valley",43.37455,-91.589809,"MJ Hatfield",adult,,Sighting,1,,,,,,,,,
137728,,2016-002272,,"Macrodactylus subspinosus","Rose Chafer",Iowa,Johnson,2012-07-01,,"Hawkeye Willdlife Management Area",41.775104,-91.705532,"Mark Brown",adult,,Photograph,1,,,,,,,,,
171158,,2016-035903,,"Macrodactylus angustatus",None,Iowa,Linn,2016-06-27,2100-2330,"Hitaga Sand Ridge Prairie Preserve",42.250957,-91.632098,"Jim Durbin",adult,Blacklight/Fluorescent,Photograph,1,77,59,62,4,300,30.06,"partly cloudy","50% visible",
172316,,2016-037061,,"Macrodactylus angustatus",None,Iowa,Linn,2016-07-20,2100-2330,"Hitaga Sand Ridge Prairie Preserve",42.250957,-91.632098,"Jim Durbin",adult,Blacklight/Fluorescent,Photograph,1,81,90,77,5,180,30.01,cloudy,full,
193982,,2017-011948,,"Macrodactylus angustatus",None,Iowa,Linn,2017-07-18,2045-2330,"Wickiup Hill Outdoor Learning Area",42.0876617,-91.767617,"Jim Durbin",adult,Blacklight/Fluorescent,Photograph,1,74,95,72,4,160,30,"partly cloudy","45 % visible",
194182,,2017-012148,,"Macrodactylus angustatus",None,Iowa,Linn,2017-07-22,2045-2330,"Hitaga Sand Ridge Prairie Preserve",42.250957,-91.632098,"Jim Durbin",adult,Blacklight/Fluorescent,Photograph,1,80,94,78,2,330,29.85,"partly cloudy","10 % visible",
194251,,2017-012217,,"Macrodactylus angustatus",None,Iowa,Linn,2017-07-22,2045-2330,"Hitaga Sand Ridge Prairie Preserve",42.250957,-91.632098,"Jim Durbin",adult,Blacklight/Fluorescent,Photograph,1,80,94,78,2,330,29.85,"partly cloudy","10 % visible",
213883,,2018-012039,,"Macrodactylus angustatus",None,Iowa,Linn,2018-07-03,2100-2330,"Wickiup Hill Outdoor Learning Area",42.087352,-91.767107,"Jim Durbin",adult,Blacklight/Fluorescent,Photograph,1,82,68,70,4,90,29.96,Clear,"80 % visible",
214063,,2018-012219,,"Macrodactylus angustatus",None,Iowa,Linn,2018-07-03,2100-2330,"Wickiup Hill Outdoor Learning Area",42.087352,-91.767107,"Jim Durbin",adult,Blacklight/Fluorescent,Photograph,1,82,68,70,4,90,29.96,Clear,"80 % visible",
214347,,2018-012503,,"Macrodactylus subspinosus","Rose Chafer",Iowa,Linn,2018-07-09,2100-2330,"Hitaga Sand Ridge Prairie Preserve",42.250957,-91.632098,"Jim Durbin",adult,Blacklight/Fluorescent,Photograph,1,80,79,73,0,0,30.11,clear,"20% visible",
215441,,2018-013598,,"Macrodactylus angustatus",None,Iowa,Linn,2018-07-18,2100-2300,"Wickiup Hill Outdoor Learning Area",42.087352,-91.767107,"Jim Durbin",adult,Blacklight/Fluorescent,Photograph,1,75,68,64,4,100,29.98,"partly cloudy","15 % visible",
224781,,2018-022659,,"Macrodactylus angustatus",None,Iowa,Appanoose,2018-06-30,,"Sundown Lake Recreation Area",40.830089,-92.747939,"Eric Liskey",adult,,Photograph,1,,,,,,,,,
231546,,2019-006259,,"Macrodactylus subspinosus","Rose Chafer",Iowa,Louisa,2019-06-11,,"Big Sand Mound Prairie Preserve, Louisa County",41.331464,-91.082392,"Jim Durbin",adult,Blacklight/Fluorescent,Photograph,1,,,,,,,,,
231554,,2019-006267,,"Macrodactylus subspinosus","Rose Chafer",Iowa,Louisa,2019-06-11,,"Big Sand Mound Prairie Preserve, Louisa County",41.331464,-91.082392,"Jim Durbin",adult,Blacklight/Fluorescent,Photograph,1,,,,,,,,,
233284,,2019-008077,,"Macrodactylus angustatus",None,Iowa,Linn,2019-07-04,2100-2315,"Wickiup Hill Outdoor Learning Area",42.086576,-91.766717,"Jim Durbin",adult,Blacklight/Fluorescent,Photograph,1,82,66,69,2,170,29.75,clear,new,
234322,,,,"Macrodactylus angustatus",None,Iowa,Johnson,2019-07-26,2100-2315,"F. W. Kent Park",41.734938,-91.721911,"Jim Durbin",adult,Blacklight/Fluorescent,Photograph,1,74,74,65,10,190,30.07,clear,"50% visible",
234333,,,,"Macrodactylus angustatus",None,Iowa,Johnson,2019-07-26,2100-2315,"F. W. Kent Park",41.734938,-91.721911,"Jim Durbin",adult,Blacklight/Fluorescent,Photograph,1,74,74,65,10,190,30.07,clear,"50% visible",
234347,,,,"Macrodactylus angustatus",None,Iowa,Johnson,2019-07-26,2100-2315,"F. W. Kent Park",41.734938,-91.721911,"Jim Durbin",adult,Blacklight/Fluorescent,Photograph,1,74,74,65,10,190,30.07,clear,"50% visible",
267838,,,,"Macrodactylus subspinosus","Rose Chafer",Iowa,Linn,2020-06-28,22:32:52,"Wickiup Hill Outdoor Learning Area",42.08735076,-91.76706884,"Jim Durbin",adult,Blacklight/Fluorescent,Photograph,1,78,76,70,4,110,29.57,clear,"50% visible",
268158,,,,"Macrodactylus angustatus",None,Iowa,Linn,2020-06-30,23:00:53,"Hitaga Sand Ridge Prairie Preserve",42.25088735,-91.63212362,"Jim Durbin",adult,Blacklight/Fluorescent,Photograph,1,78,88,74,2,100,29.85,cloudy,"80% visible",
268208,,,,"Macrodactylus angustatus",None,Iowa,Linn,2020-06-30,22:39:54,"Hitaga Sand Ridge Prairie Preserve",42.25088735,-91.63212362,"Jim Durbin",adult,Blacklight/Fluorescent,Photograph,1,78,88,74,2,100,29.85,cloudy,"80% visible",
268820,,,,"Macrodactylus subspinosus","Rose Chafer",Iowa,Linn,2020-07-24,22:12:04,"Wickiup Hill Outdoor Learning Area",42.08807239,-91.76755076,"Jim Durbin",adult,Blacklight/Fluorescent,Photograph,1,80,76,72,4,120,29.6,clear,"20% visible",
273063,"Paul Martsching Collection",2020-000638,,"Macrodactylus subspinosus","Rose Chafer",Iowa,Story,2020-07-02,,"Ames, Paul",42.016779,-93.616948,"Paul Martsching",adult,"Building Light",Pinned,1,,,,,,,,,
312434,,,,"Macrodactylus angustatus",None,Iowa,Johnson,2022-07-23,21:33:35,"F. W. Kent Park",41.73491869,-91.72188289,"Jim Durbin",adult,Blacklight/Fluorescent,Pinned,1,88,65,74,12,190,29.81,cloudy,"40 % visible",
315245,,,,"Macrodactylus subspinosus","Rose Chafer",Iowa,Johnson,2022-06-19,6:38:49,"MacBride Nature Recreation Area",41.78698569,-91.5684822,"Mark Brown",adult,Sighting,Photograph,1,,,,,,,,,
320045,,,,"Macrodactylus subspinosus","Rose Chafer",Iowa,Wapello,2022-07-16,,"Eddyville Sand Prairie Park",41.154568,-92.618726,"Jay Gilliam",adult,Sighting,Photograph,1,,,,,,,,,
320311,,,,"Macrodactylus angustatus",None,Iowa,Johnson,2022-07-16,6:22:15,"MacBride Nature Recreation Area",41.7868507,-91.56854348,"Mark Brown",adult,Sighting,Photograph,1,,,,,,,,,
336525,,,,"Macrodactylus subspinosus","Rose Chafer",Iowa,Linn,2023-07-03,22:03:33,"Hitaga Sand Ridge Prairie Preserve",42.250717995,-91.632138603333,"Jim Durbin",adult,Blacklight/Fluorescent,Photograph,1,80,77,72,0,0,29.92,clear,"full moon",
356337,,,,"Macrodactylus subspinosus","Rose Chafer",Michigan,Washtenaw,1982-06-12,,"Hudson-Mills Metropark",42.38247,-83.91259,"Kirk J. Larsen",adult,,,1,,,,,,,,,"Data from Kirk Larsen, Luther College"
356338,,,,"Macrodactylus subspinosus","Rose Chafer",Michigan,Washtenaw,1982-06-12,,"Hudson-Mills Metropark",42.38247,-83.91259,"Kirk J. Larsen",adult,,,1,,,,,,,,,"Data from Kirk Larsen, Luther College"
356339,,,,"Macrodactylus subspinosus","Rose Chafer",Michigan,Washtenaw,1982-06-12,,"Hudson-Mills Metropark",42.38247,-83.91259,"Kirk J. Larsen",adult,,,1,,,,,,,,,"Data from Kirk Larsen, Luther College"
357555,,,,"Macrodactylus subspinosus","Rose Chafer",Iowa,Winneshiek,2001-06-02,,"Luther College",43.313333,-91.803889,"Anna Rauk",adult,,,1,,,,,,,,,"Data from Kirk Larsen, Luther College"
