ID,"Collection / Source","Catalog Number","Specify Number",Taxon,"Common Name",State,County,Date,Time,Locale,Latitude,Longitude,Collector,"Life Stage","Collection Method","Preparation Type",Count,Temperature,Humidity,"Dew Point",Wind,"Wind Direction","Barometric Pressure",Sky,"Moon Phase",Notes
192534,,2017-010495,,"Draeculacephala mollipes",None,Iowa,Linn,2017-06-14,2100-2330,"Wickiup Hill Outdoor Learning Area",42.087567,-91.767578,"Jim Durbin",adult,Blacklight/Fluorescent,Photograph,1,80,73,71,3,120,29.75,cloudy,"90% visible",
193355,,2017-011320,,"Draeculacephala mollipes",None,Iowa,Linn,2017-07-04,,"Wickiup Hill Outdoor Learning Area",42.087358,-91.767092,"Jim Durbin",adult,Blacklight/Fluorescent,Photograph,1,78,78,71,3,90,30.02,"partly cloudy","80% visible",
211745,,2018-009902,,"Draeculacephala mollipes",None,Iowa,Linn,2018-06-06,2030-2315,"Wickiup Hill Outdoor Learning Area",42.087352,-91.767107,"Jim Durbin",adult,Blacklight/Fluorescent,Photograph,1,74,69,64,5,280,29.83,cloudy,"50% visible",
212256,,2018-010412,,"Draeculacephala mollipes",None,Iowa,Linn,2018-06-15,2100-2315,"Wickiup Hill Outdoor Learning Area",42.087352,-91.767107,"Jim Durbin",adult,Blacklight/Florescent,Photograph,1,84,70,73,3,120,29.79,"partly cloudy","0 % visible",
212369,,2018-010525,,"Draeculacephala mollipes",None,Iowa,Linn,2018-06-15,2100-2315,"Wickiup Hill Outdoor Learning Area",42.087352,-91.767107,"Jim Durbin",adult,Blacklight/Florescent,Photograph,1,84,70,73,3,120,29.79,"partly cloudy","0 % visible",
213866,,2018-012022,,"Draeculacephala mollipes",None,Iowa,Linn,2018-07-03,2100-2330,"Wickiup Hill Outdoor Learning Area",42.087352,-91.767107,"Jim Durbin",adult,Blacklight/Fluorescent,Photograph,1,82,68,70,4,90,29.96,Clear,"80 % visible",
214505,,2018-012661,,"Draeculacephala mollipes",None,Iowa,Linn,2018-07-09,2100-2330,"Hitaga Sand Ridge Prairie Preserve",42.250957,-91.632098,"Jim Durbin",adult,Blacklight/Fluorescent,Photograph,1,80,79,73,0,0,30.11,clear,"20% visible",
215487,,2018-013644,,"Draeculacephala mollipes",None,Iowa,Linn,2018-07-18,2100-2300,"Wickiup Hill Outdoor Learning Area",42.087352,-91.767107,"Jim Durbin",adult,Blacklight/Fluorescent,Photograph,1,75,68,64,4,100,29.98,"partly cloudy","15 % visible",
216467,,2018-014623,,"Draeculacephala mollipes",None,Iowa,Linn,2018-07-28,,"Wickiup Hill Outdoor Learning Area",42.08398,-91.7651,"Don F. Becker",adult,,Photograph,1,,,,,,,,,
216974,,2018-015130,,"Draeculacephala mollipes",None,Iowa,Linn,2018-08-01,"2045-2215. Quit early because of storms.","Wickiup Hill Outdoor Learning Area",42.087352,-91.767107,"Jim Durbin",adult,Blacklight/Fluorescent,Photograph,1,77,52,58,1,180,29.97,cloudy,"95% visible",
216975,,2018-015131,,"Draeculacephala mollipes",None,Iowa,Linn,2018-08-01,"2045-2215. Quit early because of storms.","Wickiup Hill Outdoor Learning Area",42.087352,-91.767107,"Jim Durbin",adult,Blacklight/Fluorescent,Photograph,1,77,52,58,1,180,29.97,cloudy,"95% visible",
216976,,2018-015132,,"Draeculacephala mollipes",None,Iowa,Linn,2018-08-01,"2045-2215. Quit early because of storms.","Wickiup Hill Outdoor Learning Area",42.087352,-91.767107,"Jim Durbin",adult,Blacklight/Fluorescent,Photograph,1,77,52,58,1,180,29.97,cloudy,"95% visible",
217948,,2018-016104,,"Draeculacephala mollipes",None,Iowa,Linn,2018-08-08,2045-2315,"Hitaga Sand Ridge Prairie Preserve",42.250957,-91.632098,"Jim Durbin",adult,Blacklight/Fluorescent,Photograph,1,73,83,68,6,210,29.93,clear,"10 % visible",
218312,,2018-016468,,"Draeculacephala mollipes",None,Iowa,Linn,2018-08-08,2045-2315,"Hitaga Sand Ridge Prairie Preserve",42.250957,-91.632098,"Jim Durbin",adult,Blacklight/Fluorescent,Photograph,1,73,83,68,6,210,29.93,clear,"10 % visible",
218979,,2018-017135,,"Draeculacephala mollipes",None,Iowa,Linn,2018-08-19,,"Wickiup Hill Outdoor Learning Area",42.087352,-91.767107,"Jim Durbin",adult,Blacklight/Fluorescent,Photograph,1,75,72,65,3,90,29.84,"partly cloudy","50% visible",
218983,,2018-017139,,"Draeculacephala mollipes",None,Iowa,Linn,2018-08-19,,"Wickiup Hill Outdoor Learning Area",42.087352,-91.767107,"Jim Durbin",adult,Blacklight/Fluorescent,Photograph,1,75,72,65,3,90,29.84,"partly cloudy","50% visible",
219009,,2018-017165,,"Draeculacephala mollipes",None,Iowa,Linn,2018-08-19,,"Wickiup Hill Outdoor Learning Area",42.087352,-91.767107,"Jim Durbin",adult,Blacklight/Fluorescent,Photograph,1,75,72,65,3,90,29.84,"partly cloudy","50% visible",
219281,,2018-017437,,"Draeculacephala mollipes",None,Iowa,Linn,2018-08-25,2015-2300,"Hitaga Sand Ridge Prairie Preserve",42.250604,-91.629962,"Jim Durbin",adult,Blacklight/Fluorescent,Photograph,1,74,97,73,3,310,29.91,cdlear,"Full Moon",
229989,,2019-004703,,"Draeculacephala mollipes",None,Iowa,Jefferson,2018-07-25,,"Jefferson County Park",40.98639,-91.99111,"Moni Hayne",adult,,Photograph,1,,,,,,,,,
232973,,2019-007686,,"Draeculacephala mollipes",None,Iowa,Linn,2019-06-29,2100-2345,"Wickiup Hill Outdoor Learning Area",42.0876,-91.76787,"Jim Durbin",adult,Blacklight/Fluorescent,Photograph,1,85,69,74,0,180,29.84,Clear,"10% visible",
247107,,,,"Draeculacephala mollipes",None,Iowa,Linn,2019-09-05,"2000 - 2300","Wickiup Hill Outdoor Learning Area",42.087352,-91.767107,"Jim Durbin",adult,Blacklight/Fluorescent,Photograph,1,72,71,62,3,100,29.81,clear,"50% visible",
247108,,,,"Draeculacephala mollipes",None,Iowa,Linn,2019-09-05,"2000 - 2300","Wickiup Hill Outdoor Learning Area",42.087352,-91.767107,"Jim Durbin",adult,Blacklight/Fluorescent,Photograph,1,72,71,62,3,100,29.81,clear,"50% visible",
266671,,,,"Draeculacephala mollipes",None,Iowa,Lee,2020-06-05,21:10:42,"Heron Bend Conservation Area",40.570351,-91.42323,"Angella Moorehouse",adult,Blacklight/Fluorescent,Photograph,1,,,,,,,clear,"near full","night lighting at Heron Bend Conservation area with staff from Lee County Conservation Board"
267924,,,,"Draeculacephala mollipes",None,Iowa,Linn,2020-06-28,22:55:34,"Wickiup Hill Outdoor Learning Area",42.08735076,-91.76706884,"Jim Durbin",adult,Blacklight/Fluorescent,Photograph,1,78,76,70,4,110,29.57,clear,"50% visible",
268113,,,,"Draeculacephala mollipes",None,Iowa,Linn,2020-06-28,21:26:13,"Wickiup Hill Outdoor Learning Area",42.08735076,-91.76706884,"Jim Durbin",adult,Blacklight/Fluorescent,Photograph,1,78,76,70,4,110,29.57,clear,"50% visible",
268133,,,,"Draeculacephala mollipes",None,Iowa,Linn,2020-06-28,21:18:35,"Wickiup Hill Outdoor Learning Area",42.08735076,-91.76706884,"Jim Durbin",adult,Blacklight/Fluorescent,Photograph,1,78,76,70,4,110,29.57,clear,"50% visible",
268162,,,,"Draeculacephala mollipes",None,Iowa,Linn,2020-06-30,22:58:31,"Hitaga Sand Ridge Prairie Preserve",42.25088735,-91.63212362,"Jim Durbin",adult,Blacklight/Fluorescent,Photograph,1,78,88,74,2,100,29.85,cloudy,"80% visible",
268432,,,,"Draeculacephala mollipes",None,Iowa,Linn,2020-06-30,21:26:05,"Hitaga Sand Ridge Prairie Preserve",42.25088735,-91.63212362,"Jim Durbin",adult,Blacklight/Fluorescent,Photograph,1,78,88,74,2,100,29.85,cloudy,"80% visible",
269882,,,,"Draeculacephala mollipes",None,Iowa,Linn,2020-08-08,21:45:34,"Hitaga Sand Ridge Prairie Preserve",42.25088607,-91.63213435,"Jim Durbin",adult,Blacklight/Fluorescent,Photograph,1,78,81,71,7,180,30.02,clear,"80% visible",
269883,,,,"Draeculacephala mollipes",None,Iowa,Linn,2020-08-08,21:45:33,"Hitaga Sand Ridge Prairie Preserve",42.25088607,-91.63213435,"Jim Durbin",adult,Blacklight/Fluorescent,Photograph,1,78,81,71,7,180,30.02,clear,"80% visible",
270491,,,,"Draeculacephala mollipes",None,Iowa,Scott,2019-07-27,21:01:52,"Nahant Marsh Education Center",41.48993543,-90.63568695,"Moni Hayne",adult,Blacklight/Fluorescent,Photograph,1,,,,,,,,,
270501,,,,"Draeculacephala mollipes",None,Iowa,Scott,2019-07-27,21:01:49,"Nahant Marsh Education Center",41.48993543,-90.63568695,"Moni Hayne",adult,Blacklight/Fluorescent,Photograph,1,,,,,,,,,
271432,,,,"Draeculacephala mollipes",None,Iowa,Linn,2020-09-14,20:16:19,"Wickiup Hill Outdoor Learning Area",42.08735192,-91.76707176,"Jim Durbin",adult,Blacklight/Fluorescent,Photograph,1,71,68,60,3,100,29.65,cloudy,"10% visible",
271433,,,,"Draeculacephala mollipes",None,Iowa,Linn,2020-09-14,20:17:11,"Wickiup Hill Outdoor Learning Area",42.08735192,-91.76707176,"Jim Durbin",adult,Blacklight/Fluorescent,Photograph,1,71,68,60,3,100,29.65,cloudy,"10% visible",
271509,,,,"Draeculacephala mollipes",None,Iowa,Linn,2020-09-14,20:52:25,"Wickiup Hill Outdoor Learning Area",42.08735192,-91.76707176,"Jim Durbin",adult,Blacklight/Fluorescent,Photograph,1,71,68,60,3,100,29.65,cloudy,"10% visible",
271552,,,,"Draeculacephala mollipes",None,Iowa,Linn,2020-09-14,21:14:00,"Wickiup Hill Outdoor Learning Area",42.08735192,-91.76707176,"Jim Durbin",adult,Blacklight/Fluorescent,Photograph,1,71,68,60,3,100,29.65,cloudy,"10% visible",
271603,,,,"Draeculacephala mollipes",None,Iowa,Linn,2020-09-14,19:57:01,"Wickiup Hill Outdoor Learning Area",42.08735192,-91.76707176,"Jim Durbin",adult,Blacklight/Fluorescent,Photograph,1,71,68,60,3,100,29.65,cloudy,"10% visible",
272178,,,,"Draeculacephala mollipes",None,Iowa,"Van Buren",2020-09-22,19:32:05,"Shimek State Forest, Farmington Unit",40.66548334,-91.73626721,"Jim Durbin",adult,Blacklight/Fluorescent,photograph,1,70,75,61,6,160,30.09,cloudy,"30% visible",
272247,,,,"Draeculacephala mollipes",None,Iowa,Lee,2020-09-24,19:25:33,"Shimek State Forest, Donnellson Unit",40.6445938,-91.67428614,"Jim Durbin",adult,Blacklight/Fluorescent,Photograph,1,68,77,59,8,170,29.93,clear,"30% visible",
272257,,,,"Draeculacephala mollipes",None,Iowa,Lee,2020-09-24,19:46:26,"Shimek State Forest, Donnellson Unit",40.6445938,-91.67428614,"Jim Durbin",adult,Blacklight/Fluorescent,Photograph,1,68,77,59,8,170,29.93,clear,"30% visible",
272273,,,,"Draeculacephala mollipes",None,Iowa,Lee,2020-09-24,20:49:50,"Shimek State Forest, Donnellson Unit",40.6445938,-91.67428614,"Jim Durbin",adult,Blacklight/Fluorescent,Photograph,1,68,77,59,8,170,29.93,clear,"30% visible",
272283,,,,"Draeculacephala mollipes",None,Iowa,Lee,2020-09-24,20:40:05,"Shimek State Forest, Donnellson Unit",40.6445938,-91.67428614,"Jim Durbin",adult,Blacklight/Fluorescent,Photograph,1,68,77,59,8,170,29.93,clear,"30% visible",
310909,,,,"Draeculacephala mollipes",None,Iowa,Linn,2022-06-24,21:32:57,"Pinicon Ridge Park",42.21090343,-91.54429735,"Jim Durbin",adult,Blacklight/Fluorescent,Photograph,1,75,67,62,8,180,29.96,"partly cloudy","40% moon",
311084,,,,"Draeculacephala mollipes",None,Iowa,Linn,2022-06-28,22:08:11,"Hitaga Sand Ridge Prairie Preserve",42.2510735,-91.63217209,"Jim Durbin",adult,Blacklight/Fluorescent,Photograph,1,75,50,56,6,270,30.04,"partly cloudy","new moon",
311654,,,,"Draeculacephala mollipes",None,Iowa,Linn,2022-07-02,20:09:18,"Wanatee County Park",42.01013441,-91.56662262,"Jim Durbin",adult,Blacklight/Fluorescent,Photograph,1,72,61,58,3,190,30.02,clear,"10% moon",
313989,,,,"Draeculacephala mollipes",None,Iowa,Linn,2022-08-25,20:35:37,"Hitaga Sand Ridge Prairie Preserve",42.25103416,-91.63218888,"Jim Durbin",adult,Blacklight/Fluorescent,Photograph,1,73,90,70,2,350,30.03,clear,"10% visible",
314793,,,,"Draeculacephala mollipes",None,Iowa,Linn,2022-09-15,19:42:02,"Matsell Bridge Natural Area",42.13206715,-91.38532979,"Jim Durbin",adult,Blacklight/Fluorescent,Photograph,1,80,54,64,3,180,30.05,"partly cloudy","90% visible",
332513,,,,"Draeculacephala mollipes",None,Iowa,Johnson,2022-09-24,21:40:49,Redacted,Redacted,Redacted,"Mark Brown",adult,Sighting,Photograph,1,,,,,,,,,
337368,,,,"Draeculacephala mollipes",None,Iowa,Benton,2023-07-11,21:17:47,"Wildcat Bluff Recreational Area",42.19420145,-91.8821574,"Jim Durbin",adult,Blacklight/Fluorescent,Photograph,1,76,59,61,4,330,29.92,cloudy,"50% visible",
338134,,,,"Draeculacephala mollipes",None,Iowa,Muscatine,2023-07-18,22:50:14,"Big Sand Mound Prairie Preserve, Muscatine County",41.34026787,-91.08103262,"Jim Durbin",adult,Blacklight/Fluorescent,Photograph,1,72,70,62,0,90,29.99,"partly cloudy","new moon",
338285,,,,"Draeculacephala mollipes",None,Iowa,Linn,2023-07-20,22:18:57,"Palisades Kepler State Park",41.90828891,-91.50245954,"Jim Durbin",adult,Sighting,Photograph,1,75,63,61,2,330,30,"partly cloudy","10% visible",
340337,,,,"Draeculacephala mollipes",None,Iowa,Linn,2023-08-20,20:50:37,"Pinicon Ridge Park",42.21852826,-91.53878734,"Jim Durbin",adult,Blacklight/Fluorescent,Photograph,1,87,73,77,2,360,30.09,"partly cloudy","10% visible",
340396,,,,"Draeculacephala mollipes",None,Iowa,Linn,2023-08-20,21:37:18,"Pinicon Ridge Park",42.21852826,-91.53878734,"Jim Durbin",adult,Blacklight/Fluorescent,Photograph,1,87,73,77,2,360,30.09,"partly cloudy","10% visible",
340487,,,,"Draeculacephala mollipes",None,Iowa,Linn,2023-08-20,22:10:50,"Pinicon Ridge Park",42.21852826,-91.53878734,"Jim Durbin",adult,Blacklight/Fluorescent,Photograph,1,87,73,77,2,360,30.09,"partly cloudy","10% visible",
340826,,,,"Draeculacephala mollipes",None,Iowa,Linn,2023-08-25,20:49:02,"Hitaga Sand Ridge Prairie Preserve",42.25093191,-91.63218534,"Jim Durbin",adult,Blacklight/Fluorescent,Photograph,1,81,72,71,5,345,29.93,clear,"60% visible",
340879,,,,"Draeculacephala mollipes",None,Iowa,Linn,2023-08-25,21:18:16,"Hitaga Sand Ridge Prairie Preserve",42.25093191,-91.63218534,"Jim Durbin",adult,Blacklight/Fluorescent,Photograph,1,81,72,71,5,345,29.93,clear,"60% visible",
341743,,,,"Draeculacephala mollipes",None,Iowa,Linn,2023-09-29,19:47:23,"Hitaga Sand Ridge Prairie Preserve",42.250745948333,-91.632190941667,"Jim Durbin",adult,Blacklight/Fluorescent,Photograph,1,78,75,65,9,160,30.03,clear,,
