ID,"Collection / Source","Catalog Number","Specify Number",Taxon,"Common Name",State,County,Date,Time,Locale,Latitude,Longitude,Collector,"Life Stage","Collection Method","Preparation Type",Count,Temperature,Humidity,"Dew Point",Wind,"Wind Direction","Barometric Pressure",Sky,"Moon Phase",Notes
47133,"Jim Durbin Drawer 005",2014-047511,SPM023034,"Stereomita andropogonis",None,Iowa,Linn,2011-07-16,,"Wanatee County Park",42.0094,-91.56623,"Jim Durbin",adult,Blacklight/Fluorescent,Pinned,1,,,,,,,,,
47134,,2014-047512,SPM023803,"Stereomita andropogonis",None,Iowa,Linn,2011-09-02,,"Wanatee County Park",42.0094,-91.56623,"Jim Durbin",adult,Blacklight/Fluorescent,Photograph,1,,,,,,,,,
47135,,2014-047513,SPM023825,"Stereomita andropogonis",None,Iowa,Linn,2011-09-02,,"Wanatee County Park",42.0094,-91.56623,"Jim Durbin",adult,Blacklight/Fluorescent,Photograph,1,,,,,,,,,
195588,,2017-013552,,"Stereomita andropogonis",None,Iowa,Linn,2017-08-18,2030-2300,"Wickiup Hill Outdoor Learning Area",42.087567,-91.767578,"Jim Durbin",adult,Blacklight/Fluorescent,Photograph,1,71,73,62,5,10,29.88,clear,"20% visible",
270961,,,,"Stereomita andropogonis",None,Iowa,Linn,2020-08-29,20:25:21,"Hitaga Sand Ridge Prairie Preserve",42.25085584,-91.63207192,"Jim Durbin",adult,Blacklight/Fluorescent,Photograph,1,64,64,52,5,350,29.91,clear,"90% visible",
271419,,,,"Stereomita andropogonis",None,Iowa,Linn,2020-09-14,20:03:19,"Wickiup Hill Outdoor Learning Area",42.08735192,-91.76707176,"Jim Durbin",adult,Blacklight/Fluorescent,Photograph,1,71,68,60,3,100,29.65,cloudy,"10% visible",
282290,,,,"Stereomita andropogonis",None,Iowa,Johnson,2020-08-16,,Redacted,Redacted,Redacted,"Mark Brown",adult,Sighting,Photograph,1,,,,,,,,,
291944,,,,"Stereomita andropogonis",None,Iowa,Linn,2021-08-15,22:23:08,"Pinicon Ridge Park",42.21087488,-91.54432767,"Jim Durbin",adult,Blacklight/Fluorescent,Photograph,1,72,46,50,3,90,29.96,clear,"50% visible",
292051,,,,"Stereomita andropogonis",None,Iowa,Linn,2021-08-15,21:25:08,"Pinicon Ridge Park",42.21087488,-91.54432767,"Jim Durbin",adult,Blacklight/Fluorescent,Photograph,1,72,46,50,3,90,29.96,clear,"50% visible",
292057,,,,"Stereomita andropogonis",None,Iowa,Linn,2021-08-15,21:22:27,"Pinicon Ridge Park",42.21087488,-91.54432767,"Jim Durbin",adult,Blacklight/Fluorescent,Photograph,1,72,46,50,3,90,29.96,clear,"50% visible",
292089,,,,"Stereomita andropogonis",None,Iowa,Linn,2021-08-15,20:57:45,"Pinicon Ridge Park",42.21087488,-91.54432767,"Jim Durbin",adult,Blacklight/Fluorescent,Photograph,1,72,46,50,3,90,29.96,clear,"50% visible",
313295,,,,"Stereomita andropogonis",None,Iowa,Lee,2022-08-12,21:39:59,"Shimek State Forest, Donnellson Unit",40.648403,-91.680577,"Angella Moorehouse",adult,Blacklight/Fluorescent,Photograph,1,,,,,,,,,
313755,,,,"Stereomita andropogonis",None,Iowa,Linn,2022-08-25,22:06:57,"Hitaga Sand Ridge Prairie Preserve",42.25103416,-91.63218888,"Jim Durbin",adult,Blacklight/Fluorescent,Photograph,1,73,90,70,2,350,30.03,clear,"10% visible",
313917,,,,"Stereomita andropogonis",None,Iowa,Linn,2022-08-25,20:57:18,"Hitaga Sand Ridge Prairie Preserve",42.25103416,-91.63218888,"Jim Durbin",adult,Blacklight/Fluorescent,Photograph,1,73,90,70,2,350,30.03,clear,"10% visible",
314184,,,,"Stereomita andropogonis",None,Iowa,Johnson,2022-08-30,21:54:47,"F. W. Kent Park",41.73491755,-91.72195511,"Jim Durbin",adult,Blacklight/Fluorescent,Photograph,1,69,72,60,0,0,30.04,clear,"10% visible",
314186,,,,"Stereomita andropogonis",None,Iowa,Johnson,2022-08-30,21:54:28,"F. W. Kent Park",41.73491755,-91.72195511,"Jim Durbin",adult,Blacklight/Fluorescent,Photograph,1,69,72,60,0,0,30.04,clear,"10% visible",
314189,,,,"Stereomita andropogonis",None,Iowa,Johnson,2022-08-30,21:52:49,"F. W. Kent Park",41.73491755,-91.72195511,"Jim Durbin",adult,Blacklight/Fluorescent,Photograph,1,69,72,60,0,0,30.04,clear,"10% visible",
314263,,,,"Stereomita andropogonis",None,Iowa,Johnson,2022-08-30,21:17:51,"F. W. Kent Park",41.73491755,-91.72195511,"Jim Durbin",adult,Blacklight/Fluorescent,Photograph,1,69,72,60,0,0,30.04,clear,"10% visible",
314378,,,,"Stereomita andropogonis",None,Iowa,Johnson,2022-08-30,20:41:11,"F. W. Kent Park",41.73491755,-91.72195511,"Jim Durbin",adult,Blacklight/Fluorescent,Photograph,1,69,72,60,0,0,30.04,clear,"10% visible",
314433,,,,"Stereomita andropogonis",None,Iowa,Johnson,2022-08-30,20:11:57,"F. W. Kent Park",41.73491755,-91.72195511,"Jim Durbin",adult,Blacklight/Fluorescent,Photograph,1,69,72,60,0,0,30.04,clear,"10% visible",
314436,,,,"Stereomita andropogonis",None,Iowa,Johnson,2022-08-30,20:11:05,"F. W. Kent Park",41.73491755,-91.72195511,"Jim Durbin",adult,Blacklight/Fluorescent,Photograph,1,69,72,60,0,0,30.04,clear,"10% visible",
314479,,,,"Stereomita andropogonis",None,Iowa,Linn,2022-09-05,21:20:35,"Pinicon Ridge Park",42.21852221,-91.53890027,"Jim Durbin",adult,Blacklight/Fluorescent,Photograph,1,72,87,68,2,90,30.07,cloudy,"50% visible",
317689,,,,"Stereomita andropogonis",None,Iowa,Johnson,2022-07-04,,Redacted,Redacted,Redacted,"Mark Brown",adult,Sighting,Photograph,1,,,,,,,,,
337256,,,,"Stereomita andropogonis",None,Iowa,Linn,2023-07-08,22:50:20,"Palisades Kepler State Park",41.90829802,-91.50242489,"Jim Durbin",adult,Blacklight/Fluorescent,Photograph,1,73,55,53,7,330,29.89,clear,"80% visible",
339189,,,,"Stereomita andropogonis",None,Iowa,Linn,2023-08-02,22:34:06,"Wanatee County Park",42.00997111,-91.5665254,"Jim Durbin",adult,Blacklight/Fluorescent,Photograph,1,75,94,73,3,110,30,"partly cloudy",full,
339474,,,,"Stereomita andropogonis",None,Iowa,Linn,2023-08-09,21:22:28,"Palisades Kepler State Park",41.90832623,-91.50233083,"Jim Durbin",adult,Blacklight/Fluorescent,Photograph,1,73,85,68,0,0,29.78,clear,"50% visible",
339502,,,,"Stereomita andropogonis",None,Iowa,Linn,2023-08-09,21:56:58,"Palisades Kepler State Park",41.90832623,-91.50233083,"Jim Durbin",adult,Blacklight/Fluorescent,Photograph,1,73,85,68,0,0,29.78,clear,"50% visible",
339507,,,,"Stereomita andropogonis",None,Iowa,Linn,2023-08-09,21:59:32,"Palisades Kepler State Park",41.90832623,-91.50233083,"Jim Durbin",adult,Blacklight/Fluorescent,Photograph,1,73,85,68,0,0,29.78,clear,"50% visible",
339520,,,,"Stereomita andropogonis",None,Iowa,Linn,2023-08-09,22:24:50,"Palisades Kepler State Park",41.90832623,-91.50233083,"Jim Durbin",adult,Blacklight/Fluorescent,Photograph,1,73,85,68,0,0,29.78,clear,"50% visible",
339713,,,,"Stereomita andropogonis",None,Iowa,Muscatine,2023-08-17,20:43:19,"Big Sand Mound Prairie Preserve, Muscatine County",41.34031372,-91.0810559,"Jim Durbin",adult,Blacklight/Fluorescent,Photograph,1,69,66,57,0,0,29.93,clear,"new moon",
339721,,,,"Stereomita andropogonis",None,Iowa,Muscatine,2023-08-17,20:46:35,"Big Sand Mound Prairie Preserve, Muscatine County",41.34031372,-91.0810559,"Jim Durbin",adult,Blacklight/Fluorescent,Photograph,1,69,66,57,0,0,29.93,clear,"new moon",
339726,,,,"Stereomita andropogonis",None,Iowa,Muscatine,2023-08-17,20:48:27,"Big Sand Mound Prairie Preserve, Muscatine County",41.34031372,-91.0810559,"Jim Durbin",adult,Blacklight/Fluorescent,Photograph,1,69,66,57,0,0,29.93,clear,"new moon",
339855,,,,"Stereomita andropogonis",None,Iowa,Muscatine,2023-08-17,21:56:49,"Big Sand Mound Prairie Preserve, Muscatine County",41.34031372,-91.0810559,"Jim Durbin",adult,Blacklight/Fluorescent,Photograph,1,69,66,57,0,0,29.93,clear,"new moon",
340390,,,,"Stereomita andropogonis",None,Iowa,Linn,2023-08-20,21:30:01,"Pinicon Ridge Park",42.21852826,-91.53878734,"Jim Durbin",adult,Blacklight/Fluorescent,Photograph,1,87,73,77,2,360,30.09,"partly cloudy","10% visible",
340653,,,,"Stereomita andropogonis",None,Iowa,Linn,2023-08-28,21:18:43,"Pleasant Creek State Recreation Area, Linn County",42.11016422,-91.82761742,"Jim Durbin",adult,Blacklight/Fluorescent,Photograph,1,72,68,61,0,0,29.97,clear,"90% moon",
340656,,,,"Stereomita andropogonis",None,Iowa,Linn,2023-08-28,21:18:45,"Pleasant Creek State Recreation Area, Linn County",42.11016422,-91.82761742,"Jim Durbin",adult,Blacklight/Fluorescent,Photograph,1,72,68,61,0,0,29.97,clear,"90% moon",
340696,,,,"Stereomita andropogonis",None,Iowa,Linn,2023-08-28,22:15:09,"Pleasant Creek State Recreation Area, Linn County",42.11016422,-91.82761742,"Jim Durbin",adult,Blacklight/Fluorescent,Photograph,1,72,68,61,0,0,29.97,clear,"90% moon",
340907,,,,"Stereomita andropogonis",None,Iowa,Linn,2023-08-25,21:35:01,"Hitaga Sand Ridge Prairie Preserve",42.25093191,-91.63218534,"Jim Durbin",adult,Blacklight/Fluorescent,Photograph,1,81,72,71,5,345,29.93,clear,"60% visible",
341362,,,,"Stereomita andropogonis",None,Iowa,Linn,2023-09-05,20:41:19,"Wanatee County Park",42.010077715,-91.566528441667,"Jim Durbin",adult,Blacklight/Fluorescent,Photograph,1,84,63,70,13,180,29.73,cloudy,"80% moon",
341378,,,,"Stereomita andropogonis",None,Iowa,Linn,2023-09-05,20:59:25,"Wanatee County Park",42.010077715,-91.566528441667,"Jim Durbin",adult,Blacklight/Fluorescent,Photograph,1,84,63,70,13,180,29.73,cloudy,"80% moon",
