ID,"Collection / Source","Catalog Number","Specify Number",Taxon,"Common Name",State,County,Date,Time,Locale,Latitude,Longitude,Collector,"Life Stage","Collection Method","Preparation Type",Count,Temperature,Humidity,"Dew Point",Wind,"Wind Direction","Barometric Pressure",Sky,"Moon Phase",Notes
173153,,2016-037899,,"Menosoma cincta",None,Iowa,Linn,2016-07-30,2100-2330,"Hitaga Sand Ridge Prairie Preserve",42.250957,-91.632098,"Jim Durbin",adult,Blacklight/Fluorescent,Photograph,1,72,87,68,0,0,29.92,"partly cloudy","10% visible",
173165,,2016-037911,,"Menosoma cincta",None,Iowa,Linn,2016-07-30,2100-2330,"Hitaga Sand Ridge Prairie Preserve",42.250957,-91.632098,"Jim Durbin",adult,Blacklight/Fluorescent,Photograph,1,72,87,68,0,0,29.92,"partly cloudy","10% visible",
173285,,2016-038031,,"Menosoma cincta",None,Iowa,Linn,2016-07-30,2100-2330,"Hitaga Sand Ridge Prairie Preserve",42.250957,-91.632098,"Jim Durbin",adult,Blacklight/Fluorescent,Photograph,1,72,87,68,0,0,29.92,"partly cloudy","10% visible",
173328,,2016-038074,,"Menosoma cincta",None,Iowa,Linn,2016-08-03,2100-2330,"Hitaga Sand Ridge Prairie Preserve",42.250957,-91.632098,"Jim Durbin",adult,Blacklight/Fluorescent,Photograph,1,81,74,71,3,180,29.96,clear,Dark,
174087,,2016-038842,,"Menosoma cincta",None,Iowa,Linn,2016-08-09,2030-2300,"Hitaga Sand Ridge Prairie Preserve",42.250957,-91.632098,"Jim Durbin",adult,Blacklight/Fluorescent,Photograph,1,79,79,71,0,0,29.96,clear,"40% visible",
174487,,2016-039237,,"Menosoma cincta",None,Iowa,Linn,2016-08-15,2030-2300,"Hitaga Sand Ridge Prairie Preserve",42.250957,-91.632098,"Jim Durbin",adult,Blacklight/Fluorescent,Photograph,1,75,74,66,0,0,29096,cloudy,full,
175162,,2016-039912,,"Menosoma cincta",None,Iowa,Linn,2016-08-28,2000-2230,"Hitaga Sand Ridge Prairie Preserve",42.250957,-91.632098,"Jim Durbin",adult,Blacklight/Fluorescent,Photograph,1,74,83,74,9,110,30.1,cloudy,"10% visible","Rained for about 15 minutes at 8:00PM"
175180,,2016-039930,,"Menosoma cincta",None,Iowa,Linn,2016-08-28,2000-2230,"Hitaga Sand Ridge Prairie Preserve",42.250957,-91.632098,"Jim Durbin",adult,Blacklight/Fluorescent,Photograph,1,74,83,74,9,110,30.1,cloudy,"10% visible","Rained for about 15 minutes at 8:00PM"
194601,,2017-012566,,"Menosoma cincta",None,Iowa,Linn,2017-07-29,2045-2315,"Hitaga Sand Ridge Prairie Preserve",42.250957,-91.632098,"Jim Durbin",adult,Blacklight/Fluorescent,Photograph,1,69,73,61,0,0,30.09,clear,"40% visible",
195221,,2017-013185,,"Menosoma cincta",None,Iowa,Linn,2017-08-14,2030-2300,"Hitaga Sand Ridge Prairie Preserve",42.250957,-91.632098,"Jim Durbin",adult,Blacklight/Fluorescent,Photograph,1,72,97,71,0,0,29.81,clear,"60% visible",
195228,,2017-013192,,"Menosoma cincta",None,Iowa,Linn,2017-08-14,2030-2300,"Hitaga Sand Ridge Prairie Preserve",42.250957,-91.632098,"Jim Durbin",adult,Blacklight/Fluorescent,Photograph,1,72,97,71,0,0,29.81,clear,"60% visible",
195264,,2017-013228,,"Menosoma cincta",None,Iowa,Linn,2017-08-14,2030-2300,"Hitaga Sand Ridge Prairie Preserve",42.250957,-91.632098,"Jim Durbin",adult,Blacklight/Fluorescent,Photograph,1,72,97,71,0,0,29.81,clear,"60% visible",
195310,,2017-013274,,"Menosoma cincta",None,Iowa,Linn,2017-08-14,2030-2300,"Hitaga Sand Ridge Prairie Preserve",42.250957,-91.632098,"Jim Durbin",adult,Blacklight/Fluorescent,Photograph,1,72,97,71,0,0,29.81,clear,"60% visible",
195332,,2017-013296,,"Menosoma cincta",None,Iowa,Linn,2017-08-14,2030-2300,"Hitaga Sand Ridge Prairie Preserve",42.250957,-91.632098,"Jim Durbin",adult,Blacklight/Fluorescent,Photograph,1,72,97,71,0,0,29.81,clear,"60% visible",
195459,,2017-013423,,"Menosoma cincta",None,Iowa,Linn,2017-08-14,2030-2300,"Hitaga Sand Ridge Prairie Preserve",42.250957,-91.632098,"Jim Durbin",adult,Blacklight/Fluorescent,Photograph,1,72,97,71,0,0,29.81,clear,"60% visible",
195974,,2017-013938,,"Menosoma cincta",None,Iowa,Linn,2017-08-23,2000-2300,"Hitaga Sand Ridge Prairie Preserve",42.250957,-91.632098,"Jim Durbin",adult,Blacklight/Fluorescent,Photograph,1,66,84,61,,,30.03,clear,"0 visible",
196086,,2017-014050,,"Menosoma cincta",None,Iowa,Linn,2017-08-30,2000-2300,"Hitaga Sand Ridge Prairie Preserve",42.250957,-91.632098,"Jim Durbin",adult,Blacklight/Fluorescent,Photograph,1,70,90,68,0,0,30.07,clear,"50% visible",
196332,,2017-014266,,"Menosoma cincta",None,Iowa,Linn,2017-09-14,1945-2230,"Hitaga Sand Ridge Prairie Preserve",42.250957,-91.632098,"Jim Durbin",adult,Blacklight/Fluorescent,Photograph,1,76,68,66,4,145,29.85,cloudy,"40 % visible",
202433,,2018-000579,,"Menosoma cincta",None,Iowa,Johnson,2012-08-24,,"Iowa City Site 1",41.62806,-91.51417,"Mark Brown",adult,,Photograph,1,,,,,,,,,
217927,,2018-016083,,"Menosoma cincta",None,Iowa,Linn,2018-08-08,2045-2315,"Hitaga Sand Ridge Prairie Preserve",42.250957,-91.632098,"Jim Durbin",adult,Blacklight/Fluorescent,Photograph,1,73,83,68,6,210,29.93,clear,"10 % visible",
247114,,,,"Menosoma cincta",None,Iowa,Linn,2019-08-24,2030-2300,"Hitaga Sand Ridge Prairie Preserve",42.250957,-91.632098,"Jim Durbin",adult,Blacklight/Fluorescent,Photograph,1,65,71,56,2,90,30.01,"partly cloudy","50% visible",
247115,,,,"Menosoma cincta",None,Iowa,Linn,2019-08-24,2030-2300,"Hitaga Sand Ridge Prairie Preserve",42.250957,-91.632098,"Jim Durbin",adult,Blacklight/Fluorescent,Photograph,1,65,71,56,2,90,30.01,"partly cloudy","50% visible",
269856,,,,"Menosoma cincta",None,Iowa,Linn,2020-08-08,21:53:35,"Hitaga Sand Ridge Prairie Preserve",42.25088607,-91.63213435,"Jim Durbin",adult,Blacklight/Fluorescent,Photograph,1,78,81,71,7,180,30.02,clear,"80% visible",
269923,,,,"Menosoma cincta",None,Iowa,Linn,2020-08-08,21:22:03,"Hitaga Sand Ridge Prairie Preserve",42.25088607,-91.63213435,"Jim Durbin",adult,Blacklight/Fluorescent,Photograph,1,78,81,71,7,180,30.02,clear,"80% visible",
269956,,,,"Menosoma cincta",None,Iowa,Linn,2020-08-08,21:14:34,"Hitaga Sand Ridge Prairie Preserve",42.25088607,-91.63213435,"Jim Durbin",adult,Blacklight/Fluorescent,Photograph,1,78,81,71,7,180,30.02,clear,"80% visible",
270816,,,,"Menosoma cincta",None,Iowa,Linn,2020-08-29,21:37:16,"Hitaga Sand Ridge Prairie Preserve",42.25085584,-91.63207192,"Jim Durbin",adult,Blacklight/Fluorescent,Photograph,1,64,64,52,5,350,29.91,clear,"90% visible",
270865,,,,"Menosoma cincta",None,Iowa,Linn,2020-08-29,21:08:23,"Hitaga Sand Ridge Prairie Preserve",42.25085584,-91.63207192,"Jim Durbin",adult,Blacklight/Fluorescent,Photograph,1,64,64,52,5,350,29.91,clear,"90% visible",
272483,,,,"Menosoma cincta",None,Iowa,Johnson,2020-08-16,22:17:04,Redacted,Redacted,Redacted,"Mark Brown",adult,Sighting,Photograph,1,,,,,,,,,
274766,,,,"Menosoma cincta",None,Iowa,Johnson,2020-09-15,20:16:23,Redacted,Redacted,Redacted,"Mark Brown",adult,Sighting,Photograph,1,,,,,,,,,
291284,,,,"Menosoma cincta",None,Iowa,Linn,2021-08-06,22:01:29,"Hitaga Sand Ridge Prairie Preserve",42.25082292,-91.63215158,"Jim Durbin",adult,Blacklight/Fluorescent,Photograph,1,78,72,68,4,165,29.79,cloudy,"new moon",
291320,,,,"Menosoma cincta",None,Iowa,Linn,2021-08-06,21:49:55,"Hitaga Sand Ridge Prairie Preserve",42.25082292,-91.63215158,"Jim Durbin",adult,Blacklight/Fluorescent,Photograph,1,78,72,68,4,165,29.79,cloudy,"new moon",
291347,,,,"Menosoma cincta",None,Iowa,Linn,2021-08-06,21:31:45,"Hitaga Sand Ridge Prairie Preserve",42.25082292,-91.63215158,"Jim Durbin",adult,Blacklight/Fluorescent,Photograph,1,78,72,68,4,165,29.79,cloudy,"new moon",
291362,,,,"Menosoma cincta",None,Iowa,Linn,2021-08-06,21:27:46,"Hitaga Sand Ridge Prairie Preserve",42.25082292,-91.63215158,"Jim Durbin",adult,Blacklight/Fluorescent,Photograph,1,78,72,68,4,165,29.79,cloudy,"new moon",
291430,,,,"Menosoma cincta",None,Iowa,Linn,2021-08-06,21:06:58,"Hitaga Sand Ridge Prairie Preserve",42.25082292,-91.63215158,"Jim Durbin",adult,Blacklight/Fluorescent,Photograph,1,78,72,68,4,165,29.79,cloudy,"new moon",
294981,,,,"Menosoma cincta",None,Iowa,Linn,2021-08-27,21:23:41,"Hitaga Sand Ridge Prairie Preserve",42.25082009,-91.63219999,"Jim Durbin",adult,Blacklight/Fluorescent,Photograph,1,85,80,78,4,90,29.93,clear,"80% visible",
296817,,,,"Menosoma cincta",None,Iowa,Johnson,2021-08-08,22:14:11,Redacted,Redacted,Redacted,"Mark Brown",adult,Sighting,Photograph,1,,,,,,,,,
313870,,,,"Menosoma cincta",None,Iowa,Linn,2022-08-25,21:16:25,"Hitaga Sand Ridge Prairie Preserve",42.25103416,-91.63218888,"Jim Durbin",adult,Blacklight/Fluorescent,Photograph,1,73,90,70,2,350,30.03,clear,"10% visible",
313876,,,,"Menosoma cincta",None,Iowa,Linn,2022-08-25,21:15:09,"Hitaga Sand Ridge Prairie Preserve",42.25103416,-91.63218888,"Jim Durbin",adult,Blacklight/Fluorescent,Photograph,1,73,90,70,2,350,30.03,clear,"10% visible",
313913,,,,"Menosoma cincta",None,Iowa,Linn,2022-08-25,20:59:14,"Hitaga Sand Ridge Prairie Preserve",42.25103416,-91.63218888,"Jim Durbin",adult,Blacklight/Fluorescent,Photograph,1,73,90,70,2,350,30.03,clear,"10% visible",
313941,,,,"Menosoma cincta",None,Iowa,Linn,2022-08-25,20:49:58,"Hitaga Sand Ridge Prairie Preserve",42.25103416,-91.63218888,"Jim Durbin",adult,Blacklight/Fluorescent,Photograph,1,73,90,70,2,350,30.03,clear,"10% visible",
332246,,,,"Menosoma cincta",None,Iowa,Johnson,2022-08-18,21:37:46,Redacted,Redacted,Redacted,"Mark Brown",adult,Sighting,Photograph,1,,,,,,,,,
332296,,,,"Menosoma cincta",None,Iowa,Johnson,2022-08-15,23:29:50,Redacted,Redacted,Redacted,"Mark Brown",adult,Sighting,Photograph,1,,,,,,,,,
332434,,,,"Menosoma cincta",None,Iowa,Johnson,2022-08-04,22:57:43,Redacted,Redacted,Redacted,"Mark Brown",adult,Sighting,Photograph,1,,,,,,,,,
338969,,,,"Menosoma cincta",None,Iowa,Linn,2023-07-30,22:10:39,"Hitaga Sand Ridge Prairie Preserve",42.25109448,-91.63222102,"Jim Durbin",adult,Blacklight/Fluorescent,Photograph,1,75,76,67,0,0,30.08,"mostly clear","95% moon",
339027,,,,"Menosoma cincta",None,Iowa,Linn,2023-07-30,22:43:28,"Hitaga Sand Ridge Prairie Preserve",42.25109448,-91.63222102,"Jim Durbin",adult,Blacklight/Fluorescent,Photograph,1,75,76,67,0,0,30.08,"mostly clear","95% moon",
339071,,,,"Menosoma cincta",None,Iowa,Linn,2023-07-30,23:05:45,"Hitaga Sand Ridge Prairie Preserve",42.25109448,-91.63222102,"Jim Durbin",adult,Blacklight/Fluorescent,Photograph,1,75,76,67,0,0,30.08,"mostly clear","95% moon",
339710,,,,"Menosoma cincta",None,Iowa,Muscatine,2023-08-17,20:42:33,"Big Sand Mound Prairie Preserve, Muscatine County",41.34031372,-91.0810559,"Jim Durbin",adult,Blacklight/Fluorescent,Photograph,1,69,66,57,0,0,29.93,clear,"new moon",
339761,,,,"Menosoma cincta",None,Iowa,Muscatine,2023-08-17,21:05:58,"Big Sand Mound Prairie Preserve, Muscatine County",41.34031372,-91.0810559,"Jim Durbin",adult,Blacklight/Fluorescent,Photograph,1,69,66,57,0,0,29.93,clear,"new moon",
339772,,,,"Menosoma cincta",None,Iowa,Muscatine,2023-08-17,21:18:13,"Big Sand Mound Prairie Preserve, Muscatine County",41.34031372,-91.0810559,"Jim Durbin",adult,Blacklight/Fluorescent,Photograph,1,69,66,57,0,0,29.93,clear,"new moon",
339824,,,,"Menosoma cincta",None,Iowa,Muscatine,2023-08-17,21:41:42,"Big Sand Mound Prairie Preserve, Muscatine County",41.34031372,-91.0810559,"Jim Durbin",adult,Blacklight/Fluorescent,Photograph,1,69,66,57,0,0,29.93,clear,"new moon",
339921,,,,"Menosoma cincta",None,Iowa,Muscatine,2023-08-17,22:38:46,"Big Sand Mound Prairie Preserve, Muscatine County",41.34031372,-91.0810559,"Jim Durbin",adult,Blacklight/Fluorescent,Photograph,1,69,66,57,0,0,29.93,clear,"new moon",
340779,,,,"Menosoma cincta",None,Iowa,Linn,2023-08-25,20:39:32,"Hitaga Sand Ridge Prairie Preserve",42.25093191,-91.63218534,"Jim Durbin",adult,Blacklight/Fluorescent,Photograph,1,81,72,71,5,345,29.93,clear,"60% visible",
340782,,,,"Menosoma cincta",None,Iowa,Linn,2023-08-25,20:40:06,"Hitaga Sand Ridge Prairie Preserve",42.25093191,-91.63218534,"Jim Durbin",adult,Blacklight/Fluorescent,Photograph,1,81,72,71,5,345,29.93,clear,"60% visible",
340784,,,,"Menosoma cincta",None,Iowa,Linn,2023-08-25,20:40:25,"Hitaga Sand Ridge Prairie Preserve",42.25093191,-91.63218534,"Jim Durbin",adult,Blacklight/Fluorescent,Photograph,1,81,72,71,5,345,29.93,clear,"60% visible",
340802,,,,"Menosoma cincta",None,Iowa,Linn,2023-08-25,20:44:30,"Hitaga Sand Ridge Prairie Preserve",42.25093191,-91.63218534,"Jim Durbin",adult,Blacklight/Fluorescent,Photograph,1,81,72,71,5,345,29.93,clear,"60% visible",
340851,,,,"Menosoma cincta",None,Iowa,Linn,2023-08-25,20:57:18,"Hitaga Sand Ridge Prairie Preserve",42.25093191,-91.63218534,"Jim Durbin",adult,Blacklight/Fluorescent,Photograph,1,81,72,71,5,345,29.93,clear,"60% visible",
340903,,,,"Menosoma cincta",None,Iowa,Linn,2023-08-25,21:33:44,"Hitaga Sand Ridge Prairie Preserve",42.25093191,-91.63218534,"Jim Durbin",adult,Blacklight/Fluorescent,Photograph,1,81,72,71,5,345,29.93,clear,"60% visible",
340945,,,,"Menosoma cincta",None,Iowa,Linn,2023-08-25,21:43:09,"Hitaga Sand Ridge Prairie Preserve",42.25093191,-91.63218534,"Jim Durbin",adult,Blacklight/Fluorescent,Photograph,1,81,72,71,5,345,29.93,clear,"60% visible",
341767,,,,"Menosoma cincta",None,Iowa,Linn,2023-09-29,20:26:23,"Hitaga Sand Ridge Prairie Preserve",42.250745948333,-91.632190941667,"Jim Durbin",adult,Blacklight/Fluorescent,Photograph,1,78,75,65,9,160,30.03,clear,,
341783,,,,"Menosoma cincta",None,Iowa,Linn,2023-09-29,20:42:32,"Hitaga Sand Ridge Prairie Preserve",42.250745948333,-91.632190941667,"Jim Durbin",adult,Blacklight/Fluorescent,Photograph,1,78,75,65,9,160,30.03,clear,,
347619,,,,"Menosoma cincta",None,Iowa,Johnson,2023-08-19,23:10:28,Redacted,Redacted,Redacted,"Mark Brown",adult,Sighting,Photograph,1,,,,,,,,,
