ID,"Collection / Source","Catalog Number","Specify Number",Taxon,"Common Name",State,County,Date,Time,Locale,Latitude,Longitude,Collector,"Life Stage","Collection Method","Preparation Type",Count,Temperature,Humidity,"Dew Point",Wind,"Wind Direction","Barometric Pressure",Sky,"Moon Phase",Notes
66130,,2014-066734,,"Oxyopes scalaris","Western Lynx Spiders",Iowa,Webster,2014-06-07,,"Dolliver Memorial State Park",42.3893,-94.0805,"Mark Brown",adult,,Photograph,1,,,,,,,,,
125743,,2015-016311,,"Oxyopes scalaris","Western Lynx Spiders",Iowa,Monona,2015-05-29,,"Sylvan Runkel State Preserve",42.102085,-95.971013,"Jim Durbin",adult,Blacklight/Fluorescent,Photograph,1,,,,,,,,,
137673,,2016-002217,,"Oxyopes salticus",None,Iowa,Johnson,2011-06-06,,"Iowa City Site 1",41.62806,-91.51417,"Mark Brown",adult,,Photograph,1,,,,,,,,,
147439,,2016-012066,,"Oxyopes salticus",None,Iowa,Winneshiek,2013-07-24,,"100 Acre Wood-x",0,0,"MJ Hatfield",adult,,Photograph,1,,,,,,,,,
181814,,2016-046528,,"Oxyopes salticus",None,Iowa,Johnson,2016-07-02,,"Ciha Fen Wildlife Preserve",41.82917,-91.38278,"Mark Brown",adult,,Photograph,1,,,,,,,,,
182011,,2016-046759,,"Oxyopes salticus",None,Iowa,Harrison,2016-08-14,,"Desoto National Wildlife Refuge",41.541034,-96.032612,"Mark Brown",adult,,Photograph,1,,,,,,,,,
229605,,2019-004319,,"Oxyopes scalaris","Western Lynx Spiders",Iowa,Jefferson,2018-06-12,,"Near Fairfield",41.0503,-92.024,"Moni Hayne",adult,,Photograph,1,,,,,,,,,
267484,,,,"Oxyopes scalaris","Western Lynx Spiders",Iowa,Wapello,2020-05-29,,"Eddyville Sand Prairie Park",41.154822,-92.616784,"Mark Brown",adult,Sighting,Photograph,1,,,,,,,,,
277735,,,,"Oxyopes scalaris","Western Lynx Spiders",Iowa,Linn,2020-06-14,,"Hitaga Sand Ridge Prairie Preserve",42.2513,-91.632105,"Mark Brown",adult,Sighting,Photograph,1,,,,,,,,,
277957,,,,"Oxyopes scalaris","Western Lynx Spiders",Iowa,Johnson,2020-06-28,,"F. W. Kent Park",41.735646,-91.722956,"Mark Brown",adult,"Building Light",Photograph,1,,,,,,,,,
282236,,,,"Oxyopes salticus",None,Iowa,Wapello,2020-08-04,,"Eddyville Sand Prairie Park",41.155613,-92.617153,"Mark Brown",adult,Sighting,Photograph,1,,,,,,,,,
288335,,,,"Oxyopes scalaris","Western Lynx Spiders",Iowa,Linn,2021-06-14,12:10:52,"1460 Douglas Ct, Marion",42.040069,-91.590953,"Jim Durbin",adult,Sighting,Photograph,1,,,,,,,,,
295517,,,,"Oxyopes salticus",None,Iowa,Johnson,2021-06-29,18:10:38,"Atherton Wetland",41.84566422,-91.55753709,"Mark Brown",adult,Sighting,Photograph,1,,,,,,,,,
296278,,,,"Oxyopes salticus",None,Iowa,Warren,2021-06-27,6:39:25,"Rolling Thunder Prairie State Preserve",41.200881,-93.655614,"Mark Brown",adult,Sighting,Photograph,1,,,,,,,,,
310265,,,,"Oxyopes scalaris","Western Lynx Spiders",Iowa,Linn,2022-06-06,17:11:04,"1460 Douglas Ct, Marion",42.040069,-91.590953,"Jim Durbin",adult,Sighting,Photograph,1,,,,0,0,,,,
317700,,,,"Oxyopes scalaris","Western Lynx Spiders",Iowa,Johnson,2022-07-05,,Redacted,Redacted,Redacted,"Mark Brown",adult,Sighting,Photograph,1,,,,,,,,,
319685,,,,"Oxyopes salticus",None,Iowa,Marion,2015-06-10,8:37:39,"Cordova Park",41.424986,-93.094414,"Marla Mertz",adult,Sighting,Photograph,1,,,,,,,,,"Cordova Park pavilion "
319865,,,,"Oxyopes scalaris","Western Lynx Spiders",Iowa,Madison,2022-06-04,,"Middle River Park",41.317638,-94.004713,"Jay Gilliam",adult,Sighting,Photograph,1,,,,,,,,,
320218,,,,"Oxyopes salticus",None,Iowa,Mahaska,2022-07-10,12:09:11,"Eddyville Cemetery Wetland",41.16808116,-92.63305607,"Mark Brown",adult,Sighting,Photograph,1,,,,,,,,,
334826,,,,"Oxyopes scalaris","Western Lynx Spiders",Iowa,Linn,2023-06-08,09:53:40,"1460 Douglas Ct, Marion",42.04005950666667,-91.59092034166666,"Jim Durbin",adult,Sighting,Photograph,1,,,,,,,,,
334827,,,,"Oxyopes scalaris","Western Lynx Spiders",Iowa,Linn,2023-06-08,09:50:54,"1460 Douglas Ct, Marion",42.04005950666667,-91.59092034166666,"Jim Durbin",adult,Sighting,Photograph,1,,,,,,,,,
334828,,,,"Oxyopes scalaris","Western Lynx Spiders",Iowa,Linn,2023-06-08,09:49:20,"1460 Douglas Ct, Marion",42.04005950666667,-91.59092034166666,"Jim Durbin",adult,Sighting,Photograph,1,,,,,,,,,
334872,,,,"Oxyopes scalaris","Western Lynx Spiders",Iowa,Linn,2023-06-07,10:09:52,"1460 Douglas Ct, Marion",42.040099635,-91.59093762333333,"Jim Durbin",adult,Sighting,Photograph,1,,,,,,,,,
334873,,,,"Oxyopes scalaris","Western Lynx Spiders",Iowa,Linn,2023-06-07,10:09:39,"1460 Douglas Ct, Marion",42.040099635,-91.59093762333332,"Jim Durbin",adult,Sighting,Photograph,1,,,,,,,,,
334874,,,,"Oxyopes scalaris","Western Lynx Spiders",Iowa,Linn,2023-06-07,10:09:16,"1460 Douglas Ct, Marion",42.040099635,-91.59093762333335,"Jim Durbin",adult,Sighting,Photograph,1,,,,,,,,,
335575,,,,"Oxyopes salticus",None,Iowa,Linn,2023-06-12,13:04:59,"1460 Douglas Ct, Marion",42.040094923333,-91.591176915,"Jim Durbin",adult,Sighting,Photograph,1,,,,,,,,,
335587,,,,"Oxyopes salticus",None,Iowa,Linn,2023-06-12,15:51:04,"1460 Douglas Ct, Marion",42.040094923333,-91.591176915,"Jim Durbin",adult,Sighting,Photograph,1,,,,,,,,,
335591,,,,"Oxyopes scalaris","Western Lynx Spiders",Iowa,Linn,2023-06-13,16:44:49,"1460 Douglas Ct, Marion",42.040094923333,-91.591176915,"Jim Durbin",adult,Sighting,Photograph,1,,,,,,,,,
336028,,,,"Oxyopes salticus",None,Iowa,Decatur,2023-06-27,13:05:29,Redacted,Redacted,Redacted,"Jim Durbin",adult,Sighting,Photograph,1,,,,,,,,,
338401,,,,"Oxyopes scalaris","Western Lynx Spiders",Iowa,Jackson,2023-07-19,11:07:08,"Codfish Hollow Prairie",42.073429,-90.565725,"Kenneth Heiar",adult,Sighting,Photograph,1,,,,,,,,,
342011,,,,"Oxyopes scalaris","Western Lynx Spiders",Iowa,Polk,2023-05-27,,"Union Park",41.611866,-93.608397,"Mark Brown",adult,Sighting,Photograph,1,,,,,,,,,
342399,,,,"Oxyopes salticus",None,Iowa,Warren,2023-05-28,08:04:10,"Rolling Thunder Prairie State Preserve",41.199808908333,-93.655166968333,"Mark Brown",adult,Sighting,Photograph,1,,,,,,,,,
345280,,,,"Oxyopes scalaris","Western Lynx Spiders",Iowa,Johnson,2023-07-19,19:21:53,"F. W. Kent Park",41.728623261667,-91.727369643333,"Mark Brown",adult,Sighting,Photograph,1,,,,,,,,,
366390,,,,"Oxyopes scalaris","Western Lynx Spiders",Iowa,Linn,2024-05-22,09:12:22,"1460 Douglas Ct, Marion",42.040073003333,-91.5908844,"Jim Durbin",adult,Sighting,Photograph,1,,,,,,,,,
366397,,,,"Oxyopes scalaris","Western Lynx Spiders",Iowa,Linn,2024-05-22,09:25:47,"1460 Douglas Ct, Marion",42.040073003333,-91.5908844,"Jim Durbin",adult,Sighting,Photograph,1,,,,,,,,,
366403,,,,"Oxyopes scalaris","Western Lynx Spiders",Iowa,Linn,2024-05-22,09:40:36,"1460 Douglas Ct, Marion",42.040073003333,-91.5908844,"Jim Durbin",adult,Sighting,Photograph,1,,,,,,,,,
366412,,,,"Oxyopes scalaris","Western Lynx Spiders",Iowa,Linn,2024-05-22,09:53:19,"1460 Douglas Ct, Marion",42.040073003333,-91.5908844,"Jim Durbin",adult,Sighting,Photograph,1,,,,,,,,,
366414,,,,"Oxyopes scalaris","Western Lynx Spiders",Iowa,Linn,2024-05-22,09:56:31,"1460 Douglas Ct, Marion",42.040073003333,-91.5908844,"Jim Durbin",adult,Sighting,Photograph,1,,,,,,,,,
366687,,,,"Oxyopes scalaris","Western Lynx Spiders",Iowa,Linn,2024-05-28,10:10:35,"1460 Douglas Ct, Marion",42.040072443333,-91.590911846667,"Jim Durbin",adult,Sighting,Photograph,1,,,,,,,,,
367254,,,,"Oxyopes scalaris","Western Lynx Spiders",Iowa,Linn,2024-06-01,17:09:47,"1460 Douglas Ct, Marion",42.040067071667,-91.590924716667,"Jim Durbin",adult,Sighting,Photograph,1,,,,,,,,,
367665,,,,"Oxyopes salticus",None,Iowa,Linn,2024-06-16,11:07:53,"1460 Douglas Ct, Marion",42.040090811667,-91.590910575,"Jim Durbin",adult,Sighting,Photograph,1,,,,,,,,,
367671,,,,"Oxyopes scalaris","Western Lynx Spiders",Iowa,Linn,2024-06-18,09:46:07,"1460 Douglas Ct, Marion",42.040090811667,-91.590910575,"Jim Durbin",adult,Sighting,Photograph,1,,,,,,,,,
