ID,"Collection / Source","Catalog Number","Specify Number",Taxon,"Common Name",State,County,Date,Time,Locale,Latitude,Longitude,Collector,"Life Stage","Collection Method","Preparation Type",Count,Temperature,Humidity,"Dew Point",Wind,"Wind Direction","Barometric Pressure",Sky,"Moon Phase",Notes
16219,,2014-016517,SPM023162,"Leiobunum ventricosum",None,Iowa,Linn,2011-08-06,,"Wanatee County Park",42.0094,-91.56623,"Jim Durbin",adult,Blacklight/Fluorescent,Photograph,1,,,,,,,,,
16227,,2014-016525,SPM023836,"Leiobunum ventricosum",None,Iowa,Linn,2011-09-02,,"Wanatee County Park",42.0094,-91.56623,"Jim Durbin",adult,Blacklight/Fluorescent,Photograph,1,,,,,,,,,
16228,,2014-016526,SPM023931,"Leiobunum ventricosum",None,Iowa,Linn,2011-09-11,,"Wanatee County Park",42.0094,-91.56623,"Jim Durbin",adult,Blacklight,Photograph,1,,,,,,,,,
16229,,2014-016527,SPM024201,"Leiobunum ventricosum",None,Iowa,Linn,2011-10-05,,"Wickiup Hill Outdoor Learning Area",42.08398,-91.7651,"Jim Durbin",adult,Blacklight/Fluorescent,Photograph,1,,,,,,,,,
124942,,2015-015510,,"Leiobunum ventricosum",None,Iowa,Jones,2010-05-28,,"Wapsipinicon State Park",42.08694,-91.27917,"Jim Durbin",adult,Blacklight/Fluorescent,Photograph,1,,,,,,,,,
124946,,2015-015514,,"Leiobunum ventricosum",None,Iowa,Jones,2010-05-28,,"Wapsipinicon State Park",42.08694,-91.27917,"Jim Durbin",adult,Blacklight/Fluorescent,Photograph,1,,,,,,,,,
126290,,2015-016858,,"Leiobunum ventricosum",None,Iowa,"Van Buren",2015-06-04,,"Lacey-Keosauqua State Park",40.715,-91.99056,"Jim Durbin",adult,Blacklight/Florescent,Photograph,1,,,,,,,,,
126299,,2015-016867,,"Leiobunum ventricosum",None,Iowa,"Van Buren",2015-06-04,,"Lacey-Keosauqua State Park",40.715,-91.99056,"Jim Durbin",adult,Blacklight/Florescent,Photograph,1,,,,,,,,,
126304,,2015-016872,,"Leiobunum ventricosum",None,Iowa,"Van Buren",2015-06-04,,"Lacey-Keosauqua State Park",40.715,-91.99056,"Jim Durbin",adult,Blacklight/Florescent,Photograph,1,,,,,,,,,
126668,,2015-017236,,"Leiobunum ventricosum",None,Iowa,Linn,2015-06-08,2100-2315,"Matsell Bridge Natural Area",42.131959,-91.388307,"Jim Durbin",adult,Blacklight/Fluorescent,Photograph,1,77,49,56,0,210,29.78,clear,"55% visible",
194716,,2017-012680,,"Leiobunum ventricosum",None,Iowa,Linn,2017-08-01,2045-2300,"Matsell Bridge Natural Area",42.131126,-91.388999,"Jim Durbin",adult,Blacklight/Fluorescent,Photograph,1,83,91,57,5,210,30.03,cloudy,"50% visible",
340854,,,,"Leiobunum ventricosum",None,Iowa,Linn,2023-08-25,21:12:08,"Hitaga Sand Ridge Prairie Preserve",42.25093191,-91.63218534,"Jim Durbin",adult,Blacklight/Fluorescent,Photograph,1,81,72,71,5,345,29.93,clear,"60% visible",
366567,,,,"Leiobunum ventricosum",None,Iowa,Cedar,2024-05-29,10:08:01,"Draco Hill",41.745346741667,-91.265379076667,"Jim Durbin",adult,Sighting,Photograph,1,,,,,,,,,
366651,,,,"Leiobunum ventricosum",None,Iowa,Cedar,2024-05-29,10:05:05,"Draco Hill",41.74534674166666,-91.26537907666669,"Jim Durbin",adult,Sighting,Photograph,1,,,,,,,,,
366938,,,,"Leiobunum ventricosum",None,Iowa,Linn,2024-06-13,20:41:09,"Palisades Kepler State Park",41.908442985,-91.502358681667,"Jim Durbin",adult,Blacklight/Fluorescent,Photograph,1,79,42,54,6,0,29.88,clear,"40 % visible",
367547,,,,"Leiobunum ventricosum",None,Iowa,Linn,2024-06-21,21:15:10,"Palisades Kepler State Park",41.908421415,-91.502343391667,"Jim Durbin",adult,Blacklight/Fluorescent,Photograph,1,81,70,77,4,180,29.99,"partly cloudy","full moon",
