ID,"Collection / Source","Catalog Number","Specify Number",Taxon,"Common Name",State,County,Date,Time,Locale,Latitude,Longitude,Collector,"Life Stage","Collection Method","Preparation Type",Count,Temperature,Humidity,"Dew Point",Wind,"Wind Direction","Barometric Pressure",Sky,"Moon Phase",Notes
16654,"Frank Olsen Drawer 49",2014-016952,SPM002953,"Argyrotaenia alisellana","White-spotted Leafroller Moth",Iowa,Muscatine,2004-06-06,,"Wildcat Den State Park",41.4705,-90.88228,"Frank Olsen",adult,,Pinned,1,,,,,,,,,"Located at Iowa State"
16655,"Frank Olsen Drawer 49",2014-016953,SPM002954,"Argyrotaenia alisellana","White-spotted Leafroller Moth",Iowa,Linn,2004-06-03,,"Wickiup Hill Outdoor Learning Area",42.08398,-91.7651,"Frank Olsen",adult,,Pinned,1,,,,,,,,,"Located at Iowa State"
16656,"Frank Olsen Drawer 49",2014-016954,SPM013038,"Argyrotaenia alisellana","White-spotted Leafroller Moth",Iowa,"Van Buren",2008-06-07,,"Shimek State Forest, Farmington Unit",40.64802,-91.7254,"Frank Olsen",adult,,Pinned,1,,,,,,,,,"Located at Iowa State"
16657,,2014-016955,SPM016552,"Argyrotaenia alisellana","White-spotted Leafroller Moth",Iowa,Allamakee,2009-06-20,,"Heritage Valley",43.37455,-91.589809,"MJ Hatfield",adult,,Pinned,1,,,,,,,,,
16658,"Jim Durbin Drawer 021",2014-016956,SPM017799,"Argyrotaenia alisellana","White-spotted Leafroller Moth","West Virginia",Preston,2010-06-02,,"Sand Springs Camping Area",39.685263,-79.773255,"Jim Durbin",adult,Blacklight/Fluorescent,Pinned,1,,,,,,,,,
16659,"Frank Olsen Drawer 49",2014-016957,SPM020440,"Argyrotaenia alisellana","White-spotted Leafroller Moth",Iowa,Linn,2010-06-03,,"Pinicon Ridge Park",42.21188,-91.54753,"Frank Olsen",adult,,Pinned,1,,,,,,,,,"Located at Iowa State"
16660,"Jim Durbin Drawer 021",2014-016958,SPM021702,"Argyrotaenia alisellana","White-spotted Leafroller Moth",Iowa,"Van Buren",2011-06-05,,"Shimek State Forest, Farmington Unit",40.6659,-91.73637,"Jim Durbin",adult,Blacklight/Fluorescent,Pinned,1,,,,,,,,,
16661,"Jim Durbin Drawer 021",2014-016959,SPM021703,"Argyrotaenia alisellana","White-spotted Leafroller Moth",Iowa,"Van Buren",2011-06-05,,"Shimek State Forest, Farmington Unit",40.6659,-91.73637,"Jim Durbin",adult,Blacklight/Fluorescent,Pinned,1,,,,,,,,,
16662,,2014-016960,SPM021704,"Argyrotaenia alisellana","White-spotted Leafroller Moth",Iowa,"Van Buren",2011-06-05,,"Shimek State Forest, Farmington Unit",40.6659,-91.73637,"Jim Durbin",adult,Blacklight/Fluorescent,Photograph,1,,,,,,,,,
16663,,2014-016961,SPM021705,"Argyrotaenia alisellana","White-spotted Leafroller Moth",Iowa,"Van Buren",2011-06-05,,"Shimek State Forest, Farmington Unit",40.6659,-91.73637,"Jim Durbin",adult,Blacklight/Fluorescent,Photograph,1,,,,,,,,,
16664,"Frank Olsen Drawer 49",2014-016962,SPM024857,"Argyrotaenia alisellana","White-spotted Leafroller Moth",Iowa,"Van Buren",2011-06-03,,"Shimek State Forest, Farmington Unit",40.6659,-91.73637,"Frank Olsen",adult,,Pinned,1,,,,,,,,,"Located at Iowa State"
16665,"Frank Olsen Drawer 49",2014-016963,SPM024993,"Argyrotaenia alisellana","White-spotted Leafroller Moth",Iowa,"Van Buren",2011-06-03,,"Shimek State Forest, Farmington Unit",40.6659,-91.73637,"Frank Olsen",adult,,Pinned,1,,,,,,,,,"Located at Iowa State"
16666,"Jim Durbin Drawer 021",2014-016964,SPM027423,"Argyrotaenia alisellana","White-spotted Leafroller Moth",Iowa,Lee,2012-05-19,,"Shimek State Forest, Croton Unit East",40.54693,-91.61435,"Tom Jantscher",adult,,Pinned,1,,,,,,,,,
16667,,2014-016965,SPM028082,"Argyrotaenia alisellana","White-spotted Leafroller Moth",Iowa,Linn,2012-06-05,,"Wanatee County Park",42.01026,-91.57381,"Jim Durbin",adult,Blacklight/Fluorescent,Photograph,1,,,,,,,,,
16668,"Jim Durbin Drawer 021",2014-016966,SPM033770,"Argyrotaenia alisellana","White-spotted Leafroller Moth",Iowa,Lee,2013-06-08,,"Chatfield Park, Keokuk",40.435,-91.45222,"Tom Jantscher",adult,,Pinned,1,,,,,,,,,
16669,,2014-016967,SPM034082,"Argyrotaenia alisellana","White-spotted Leafroller Moth",Iowa,Linn,2013-06-18,,"Matsell Bridge Natural Area",42.13131,-91.38886,"Jim Durbin",adult,Blacklight/Fluorescent,Photograph,1,,,,,,,,,
16670,,2014-016968,SPM034093,"Argyrotaenia alisellana","White-spotted Leafroller Moth",Iowa,Linn,2013-06-18,,"Matsell Bridge Natural Area",42.13131,-91.38886,"Jim Durbin",adult,Blacklight/Fluorescent,Photograph,1,,,,,,,,,
16671,,2014-016969,SPM034102,"Argyrotaenia alisellana","White-spotted Leafroller Moth",Iowa,Linn,2013-06-18,,"Matsell Bridge Natural Area",42.13131,-91.38886,"Jim Durbin",adult,Blacklight/Fluorescent,Photograph,1,,,,,,,,,
16672,,2014-016970,SPM037130,"Argyrotaenia alisellana","White-spotted Leafroller Moth",Iowa,Allamakee,2009-06-20,,"Heritage Valley",43.37455,-91.589809,"MJ Hatfield",adult,,Photograph,1,,,,,,,,,
69098,,2014-069705,,"Argyrotaenia alisellana","White-spotted Leafroller Moth",Iowa,Allamakee,2009-06-20,,"Heritage Valley",43.37455,-91.589809,"Moni Hayne",adult,Blacklight/Fluorescent,Sighting,1,,,,,,,,,
108305,,2014-109052,,"Argyrotaenia alisellana","White-spotted Leafroller Moth",Iowa,Lee,2014-06-14,,"Chatfield Park, Keokuk",40.4352778,-91.4522222,"Tom Jantscher",adult,,Photograph,1,73,,,3,105,," 44% cloud cover",,"Hilly mature oak-hickory forest"
125833,"Jim Durbin Drawer 021",2015-016401,,"Argyrotaenia alisellana","White-spotted Leafroller Moth",Iowa,"Van Buren",2015-06-02,"2100 to 2300","Shimek State Forest, Farmington Unit",40.6659,-91.73637,"Jim Durbin",adult,Blacklight/Fluorescent,Pinned,1,66,73,57,4,210,30.02,clear,Full,
125838,,2015-016406,,"Argyrotaenia alisellana","White-spotted Leafroller Moth",Iowa,"Van Buren",2015-06-02,"2100 to 2300","Shimek State Forest, Farmington Unit",40.6659,-91.73637,"Jim Durbin",adult,Blacklight/Fluorescent,Photograph,1,66,73,57,4,210,30.02,clear,Full,
125852,,2015-016420,,"Argyrotaenia alisellana","White-spotted Leafroller Moth",Iowa,"Van Buren",2015-06-02,"2100 to 2300","Shimek State Forest, Farmington Unit",40.6659,-91.73637,"Jim Durbin",adult,Blacklight/Fluorescent,Photograph,1,66,73,57,4,210,30.02,clear,Full,
125868,,2015-016436,,"Argyrotaenia alisellana","White-spotted Leafroller Moth",Iowa,"Van Buren",2015-06-02,"2100 to 2300","Shimek State Forest, Farmington Unit",40.6659,-91.73637,"Jim Durbin",adult,Blacklight/Fluorescent,Photograph,1,66,73,57,4,210,30.02,clear,Full,
125871,,2015-016439,,"Argyrotaenia alisellana","White-spotted Leafroller Moth",Iowa,"Van Buren",2015-06-02,"2100 to 2300","Shimek State Forest, Farmington Unit",40.6659,-91.73637,"Jim Durbin",adult,Blacklight/Fluorescent,Photograph,1,66,73,57,4,210,30.02,clear,Full,
125874,,2015-016442,,"Argyrotaenia alisellana","White-spotted Leafroller Moth",Iowa,"Van Buren",2015-06-02,"2100 to 2300","Shimek State Forest, Farmington Unit",40.6659,-91.73637,"Jim Durbin",adult,Blacklight/Fluorescent,Photograph,1,66,73,57,4,210,30.02,clear,Full,
125895,,2015-016463,,"Argyrotaenia alisellana","White-spotted Leafroller Moth",Iowa,"Van Buren",2015-06-02,"2100 to 2300","Shimek State Forest, Farmington Unit",40.6659,-91.73637,"Jim Durbin",adult,Blacklight/Fluorescent,Photograph,1,66,73,57,4,210,30.02,clear,Full,
125905,,2015-016473,,"Argyrotaenia alisellana","White-spotted Leafroller Moth",Iowa,"Van Buren",2015-06-02,"2100 to 2300","Shimek State Forest, Farmington Unit",40.6659,-91.73637,"Jim Durbin",adult,Blacklight/Fluorescent,Photograph,1,66,73,57,4,210,30.02,clear,Full,
125919,,2015-016487,,"Argyrotaenia alisellana","White-spotted Leafroller Moth",Iowa,"Van Buren",2015-06-02,"2100 to 2300","Shimek State Forest, Farmington Unit",40.6659,-91.73637,"Jim Durbin",adult,Blacklight/Fluorescent,Photograph,1,66,73,57,4,210,30.02,clear,Full,
125930,,2015-016498,,"Argyrotaenia alisellana","White-spotted Leafroller Moth",Iowa,"Van Buren",2015-06-02,"2100 to 2300","Shimek State Forest, Farmington Unit",40.6659,-91.73637,"Jim Durbin",adult,Blacklight/Fluorescent,Photograph,1,66,73,57,4,210,30.02,clear,Full,
126163,,2015-016731,,"Argyrotaenia alisellana","White-spotted Leafroller Moth",Iowa,Lee,2015-06-03,,"Shimek State Forest, Donnellson Unit",40.645189,-91.674665,"Jim Durbin",adult,Blacklight/Fluorescent,Photograph,1,,,,,,,,,
126188,,2015-016756,,"Argyrotaenia alisellana","White-spotted Leafroller Moth",Iowa,Lee,2015-06-03,,"Shimek State Forest, Donnellson Unit",40.645189,-91.674665,"Jim Durbin",adult,Blacklight/Fluorescent,Photograph,1,,,,,,,,,
126213,,2015-016781,,"Argyrotaenia alisellana","White-spotted Leafroller Moth",Iowa,Lee,2015-06-03,,"Shimek State Forest, Donnellson Unit",40.645189,-91.674665,"Jim Durbin",adult,Blacklight/Fluorescent,Photograph,1,,,,,,,,,
126414,,2015-016982,,"Argyrotaenia alisellana","White-spotted Leafroller Moth",Iowa,Linn,2015-06-05,2100-2315,"Wanatee County Park",42.01026,-91.57381,"Jim Durbin",adult,Blacklight/Fluorescent,Photograph,1,78,79,58,16,90,30.1,clear,"90% Moon visible",
126439,,2015-017007,,"Argyrotaenia alisellana","White-spotted Leafroller Moth",Iowa,Linn,2015-06-05,2100-2315,"Wanatee County Park",42.01026,-91.57381,"Jim Durbin",adult,Blacklight/Fluorescent,Photograph,1,78,79,58,16,90,30.1,clear,"90% Moon visible",
133368,"Paul Martsching Collection",2015-023962,,"Argyrotaenia alisellana","White-spotted Leafroller Moth",Iowa,Story,2008-06-06,,"Ames, Paul",42.02064,-93.623952,"Paul Martsching",adult,"Building Light",Pinned,1,,,,,,,,,
176821,"Paul Martsching Collection",2016-041571,,"Argyrotaenia alisellana","White-spotted Leafroller Moth",Iowa,Story,2016-06-05,,"Ames, Paul",42.02064,-93.623952,"Paul Martsching",adult,"Building Light",Pinned,1,,,,,,,,,
182646,,2017-000607,,"Argyrotaenia alisellana","White-spotted Leafroller Moth",Iowa,Winneshiek,2016-06-12,,"100 Acre Wood-x",0,0,"MJ Hatfield",adult,,Photograph,1,,,,,,,,,
194982,,2017-012946,,"Argyrotaenia alisellana","White-spotted Leafroller Moth",Iowa,Appanoose,2016-05-29,,"Sundown Lake Recreation Area",40.830089,-92.747939,"Eric Liskey",adult,,Photograph,1,,,,,,,,,
194997,,2017-012961,,"Argyrotaenia alisellana","White-spotted Leafroller Moth",Iowa,Appanoose,2015-06-06,,"Sundown Lake Recreation Area",40.830089,-92.747939,"Eric Liskey",adult,,Photograph,1,,,,,,,,,
196713,,2017-014645,,"Argyrotaenia alisellana","White-spotted Leafroller Moth",Iowa,Story,2017-06-15,,"Ames, Paul",42.02064,-93.623952,"Paul Martsching",adult,"Building Light",Sighting,1,,,,,,,,,
274698,"Frank Olsen Drawer 49",2020-000714,,"Argyrotaenia alisellana","White-spotted Leafroller Moth",Iowa,Decatur,2011-06-07,,Redacted,Redacted,Redacted,"Ed Freese",adult,Blacklight/Florescent,Pinned,1,,,,,,,,,"Located at Iowa State"
309913,,,,"Argyrotaenia alisellana","White-spotted Leafroller Moth",Iowa,Linn,2022-06-09,21:08:48,"Matsell Bridge Natural Area",42.1322708,-91.38538363,"Jim Durbin",adult,Blacklight/Fluorescent,Photograph,1,68,59,53,0,0,29.95,cloudy,"60% visible",
309930,,,,"Argyrotaenia alisellana","White-spotted Leafroller Moth",Iowa,Linn,2022-06-09,21:03:17,"Matsell Bridge Natural Area",42.1322708,-91.38538363,"Jim Durbin",adult,Blacklight/Fluorescent,Photograph,1,68,59,53,0,0,29.95,cloudy,"60% visible",
334906,,,,"Argyrotaenia alisellana","White-spotted Leafroller Moth",Iowa,Linn,2023-06-07,22:36:59,"Pinicon Ridge Park",42.210859176666666,-91.54448714333333,"Jim Durbin",adult,Sighting,Photograph,1,64,58,49,1,280,29.87,"partly cloudy","90% visible",
334909,,,,"Argyrotaenia alisellana","White-spotted Leafroller Moth",Iowa,Linn,2023-06-07,22:35:50,"Pinicon Ridge Park",42.210859176666666,-91.54448714333333,"Jim Durbin",adult,Sighting,Photograph,1,64,58,49,1,280,29.87,"partly cloudy","90% visible",
334914,,,,"Argyrotaenia alisellana","White-spotted Leafroller Moth",Iowa,Linn,2023-06-07,22:34:31,"Pinicon Ridge Park",42.210859176666666,-91.54448714333333,"Jim Durbin",adult,Sighting,Photograph,1,64,58,49,1,280,29.87,"partly cloudy","90% visible",
334918,,,,"Argyrotaenia alisellana","White-spotted Leafroller Moth",Iowa,Linn,2023-06-07,22:33:35,"Pinicon Ridge Park",42.210859176666666,-91.54448714333333,"Jim Durbin",adult,Sighting,Photograph,1,64,58,49,1,280,29.87,"partly cloudy","90% visible",
334937,,,,"Argyrotaenia alisellana","White-spotted Leafroller Moth",Iowa,Linn,2023-06-07,22:14:48,"Pinicon Ridge Park",42.210859176666666,-91.54448714333333,"Jim Durbin",adult,Sighting,Photograph,1,64,58,49,1,280,29.87,"partly cloudy","90% visible",
334953,,,,"Argyrotaenia alisellana","White-spotted Leafroller Moth",Iowa,Linn,2023-06-07,22:08:37,"Pinicon Ridge Park",42.210859176666666,-91.54448714333333,"Jim Durbin",adult,Sighting,Photograph,1,64,58,49,1,280,29.87,"partly cloudy","90% visible",
355879,,,,"Argyrotaenia alisellana","White-spotted Leafroller Moth",Iowa,Winneshiek,2018-06-05,,"Hickory Ridge Woods",43.3178,-91.7959,"Lena Schmitt",adult,,,1,,,,,,,,,"Data from Kirk Larsen, Luther College"
356826,,,,"Argyrotaenia alisellana","White-spotted Leafroller Moth",Iowa,Winneshiek,2018-06-06,,"Lionberger Environmental Preserve",43.334148,-91.871215,"Lena Schmitt",adult,,,1,,,,,,,,,"Data from Kirk Larsen, Luther College"
366650,,,,"Argyrotaenia alisellana","White-spotted Leafroller Moth",Iowa,Linn,2024-06-01,21:31:05,"Pinicon Ridge Park",42.218527777778,-91.538827777778,"Jim Durbin",adult,Blacklight/Fluorescent,Photograph,1,68,83,61,,,29*.88,clear,"40 % visible",
