ID,"Collection / Source","Catalog Number","Specify Number",Taxon,"Common Name",State,County,Date,Time,Locale,Latitude,Longitude,Collector,"Life Stage","Collection Method","Preparation Type",Count,Temperature,Humidity,"Dew Point",Wind,"Wind Direction","Barometric Pressure",Sky,"Moon Phase",Notes
147248,,2016-011875,,"Pteronarcys pictetii","Midwestern Salmonfly",Iowa,Winneshiek,2011-06-07,,"100 Acre Wood-x",0,0,"MJ Hatfield",adult,,Photograph,1,,,,,,,,,
147446,,2016-012073,,"Pteronarcys pictetii","Midwestern Salmonfly",Iowa,Winneshiek,2013-06-15,,"100 Acre Wood-x",0,0,"MJ Hatfield",adult,,Photograph,1,,,,,,,,,
215202,,2018-013358,,"Pteronarcys pictetii","Midwestern Salmonfly",Iowa,Winneshiek,2018-05-27,,"100 Acre Wood-x",0,0,"MJ Hatfield",adult,"Blacklight Trap",Photograph,1,,,,,,,,,
215244,,2018-013400,,"Pteronarcys pictetii","Midwestern Salmonfly",Iowa,Winneshiek,2018-05-28,,"100 Acre Wood-x",0,0,"MJ Hatfield",adult,"Blacklight Trap",Photograph,1,,,,,,,,,
215294,,2018-013450,,"Pteronarcys pictetii","Midwestern Salmonfly",Iowa,Winneshiek,2018-05-30,,"100 Acre Wood-x",0,0,"MJ Hatfield",adult,"Blacklight Trap",Photograph,1,,,,,,,,,
215402,,2018-013558,,"Pteronarcys pictetii","Midwestern Salmonfly",Iowa,Winneshiek,2018-06-01,,"100 Acre Wood-x",0,0,"MJ Hatfield",adult,"Blacklight Trap",Photograph,1,,,,,,,,,
215749,,2018-013905,,"Pteronarcys pictetii","Midwestern Salmonfly",Iowa,Winneshiek,2018-06-06,,"100 Acre Wood-x",0,0,"MJ Hatfield",adult,"Blacklight Trap",Photograph,1,,,,,,,,,
215792,,2018-013948,,"Pteronarcys pictetii","Midwestern Salmonfly",Iowa,Winneshiek,2018-06-06,,"100 Acre Wood-x",0,0,"MJ Hatfield",adult,"Blacklight Trap",Photograph,1,,,,,,,,,
216533,,2018-014689,,"Pteronarcys pictetii","Midwestern Salmonfly",Iowa,Winneshiek,2018-06-14,,"100 Acre Wood-x",0,0,"MJ Hatfield",adult,"Blacklight Trap",Photograph,1,,,,,,,,,
216546,,2018-014702,,"Pteronarcys pictetii","Midwestern Salmonfly",Iowa,Winneshiek,2018-06-14,,"100 Acre Wood-x",0,0,"MJ Hatfield",adult,"Blacklight Trap",Photograph,1,,,,,,,,,
216565,,2018-014721,,"Pteronarcys pictetii","Midwestern Salmonfly",Iowa,Winneshiek,2018-06-15,,"100 Acre Wood-x",0,0,"MJ Hatfield",adult,"Blacklight Trap",Photograph,1,,,,,,,,,
216574,,2018-014730,,"Pteronarcys pictetii","Midwestern Salmonfly",Iowa,Winneshiek,2018-06-16,,"100 Acre Wood-x",0,0,"MJ Hatfield",adult,"Blacklight Trap",Photograph,1,,,,,,,,,
230515,,2019-005749,,"Isoperla bilineata",None,Iowa,Linn,2019-05-30,,"Hitaga Sand Ridge Prairie Preserve",42.250957,-91.632098,"Jim Durbin",adult,Blacklight/Fluorescent,Photograph,1,68,81,62,,,29.82,"partly cloidy","10% visible",
265126,,,,"Pteronarcys pictetii","Midwestern Salmonfly",Iowa,Linn,2020-05-27,21:31:32,"Matsell Bridge Natural Area",42.13204088,-91.38537304,"Jim Durbin",adult,Blacklight/Fluorescent,Photograph,1,73,94,72,0,280,29.89,cloudy,"10% visible",
265241,,,,"Pteronarcys pictetii","Midwestern Salmonfly",Iowa,Linn,2020-06-01,21:34:37,"Rehrauer Natural Area",42.2551662,-91.4885161,"Jim Durbin",adult,Blacklight/Fluorescent,Photograph,1,,,,,,,,,
266575,,,,"Isoperla bilineata",None,Iowa,Lee,2020-06-05,21:10:42,"Heron Bend Conservation Area",40.570351,-91.42323,"Angella Moorehouse",adult,Blacklight/Fluorescent,Photograph,1,,,,,,,clear,"near full","night lighting at Heron Bend Conservation area with staff from Lee County Conservation Board"
266619,,,,"Pteronarcys pictetii","Midwestern Salmonfly",Iowa,Lee,2020-06-05,21:10:42,"Heron Bend Conservation Area",40.570351,-91.42323,"Angella Moorehouse",adult,Blacklight/Fluorescent,Photograph,1,,,,,,,clear,"near full","night lighting at Heron Bend Conservation area with staff from Lee County Conservation Board"
270623,,,,"Perlesta xube",None,Iowa,Linn,2020-06-28,23:16:22,"Wickiup Hill Outdoor Learning Area",42.08735076,-91.76706884,"Jim Durbin",adult,Sighting,Photograph,1,,,,,,,,,
270664,,,,"Neoperla undetermined",None,Iowa,Linn,2020-07-30,21:39:06,"Matsell Bridge Natural Area",42.1321277,-91.38531247,"Jim Durbin",adult,Sighting,Photograph,1,,,,,,,,,
287380,,,,"Pteronarcys pictetii","Midwestern Salmonfly",Iowa,Cedar,2021-03-19,16:16:12,"Cedar County Conservation",41.76178393,-91.12362149,"Sarah Subbert",adult,Sighting,Photograph,1,,,,,,,,,
310176,,,,"Isoperla bilineata",None,Iowa,Linn,2022-06-12,20:31:18,"Pinicon Ridge Park",42.21093766,-91.54432936,"Jim Durbin",adult,Sighting,Photograph,1,79,78,70,0,0,29.85,clear,full,
310848,,,,"Neoperla clymene",None,Iowa,Linn,2022-06-24,21:53:03,"Pinicon Ridge Park",42.21090343,-91.54429735,"Jim Durbin",adult,Blacklight/Fluorescent,Photograph,1,75,67,62,8,180,29.96,"partly cloudy","40% moon",
310899,,,,"Neoperla clymene",None,Iowa,Linn,2022-06-24,21:35:22,"Pinicon Ridge Park",42.21090343,-91.54429735,"Jim Durbin",adult,Blacklight/Fluorescent,Photograph,1,75,67,62,8,180,29.96,"partly cloudy","40% moon",
311660,,,,"Neoperla clymene",None,Iowa,Linn,2022-07-02,21:55:52,"Wanatee County Park",42.01013441,-91.56662262,"Jim Durbin",adult,Blacklight/Fluorescent,Photograph,1,72,61,58,3,190,30.02,clear,"10% moon",
311821,,,,"Neoperla clymene",None,Iowa,Linn,2022-07-12,22:43:13,"Matsell Bridge Natural Area",42.13222612,-91.38533046,"Jim Durbin",adult,Sighting,Photograph,1,73,80,67,0,0,29.93,clear,"full moon",
334471,,,,"Isoperla bilineata",None,Iowa,Linn,2023-05-15,21:05:15,"Wanatee County Park",42.01004004666667,-91.56646889666666,"Jim Durbin",adult,Blacklight/Fluorescent,Photograph,1,,,,0,,,,,
335121,,,,"Isoperla bilineata",None,Iowa,Fremont,2023-06-18,"10:00 PM",Hamburg,40.600212,-95.659458,"Randy Garlipp",adult,Sighting,Photograph,1,,,,,,,,,
335544,,,,"Isoperla bilineata",None,Iowa,Muscatine,2023-06-21,23:06:14,"Big Sand Mound Prairie Preserve, Muscatine County",41.342624268333,-91.086409253333,"Jim Durbin",adult,Blacklight/Fluorescent,Photograph,1,80,56,63,0,90,30.01,clear,"10% visible",
335874,,,,"Perlesta nelsoni",None,Iowa,Polk,2023-06-25,22:38:22,"Yellow Banks Park",41.548183631667,-93.473158521667,"Jim Durbin",adult,Blacklight/Fluorescent,Photograph,1,73,67,61,11,270,29.81,clear,"40% visible",
336561,,,,"Neoperla clymene",None,Iowa,Linn,2023-07-03,22:10:40,"Hitaga Sand Ridge Prairie Preserve",42.250717995,-91.632138603333,"Jim Durbin",adult,Blacklight/Fluorescent,Photograph,1,80,77,72,0,0,29.92,clear,"full moon",
336592,,,,"Neoperla clymene",None,Iowa,Linn,2023-07-03,22:54:36,"Hitaga Sand Ridge Prairie Preserve",42.250717995,-91.632138603333,"Jim Durbin",adult,Blacklight/Fluorescent,Photograph,1,80,77,72,0,0,29.92,clear,"full moon",
337381,,,,"Perlesta xube",None,Iowa,Benton,2023-07-11,21:33:01,"Wildcat Bluff Recreational Area",42.19420145,-91.8821574,"Jim Durbin",adult,Blacklight/Fluorescent,Photograph,1,76,59,61,4,330,29.92,cloudy,"50% visible",
337621,,,,"Perlesta xube",None,Iowa,Story,2023-07-13,21:29:57,"Reiman Gardens Area, Ames",42.01002794,-93.63860655,"Jim Durbin",adult,Blacklight/Fluorescent,Photograph,1,,,,,,,,,
354393,,,,"Allocapnia granulata","Common Snowfly",Iowa,Winneshiek,2008-03-13,,"Decorah Community Prairie",43.3015,-91.8025,"Kirk J. Larsen",adult,,,1,,,,,,,,,"Data from Kirk Larsen, Luther College"
354394,,,,"Allocapnia granulata","Common Snowfly",Iowa,Winneshiek,2008-03-13,,"Decorah Community Prairie",43.3015,-91.8025,"Kirk J. Larsen",adult,,,1,,,,,,,,,"Data from Kirk Larsen, Luther College"
354395,,,,"Allocapnia granulata","Common Snowfly",Iowa,Winneshiek,2011-03-13,,"Decorah Community Prairie",43.3015,-91.8025,"Kirk J. Larsen",adult,,,1,,,,,,,,,"Data from Kirk Larsen, Luther College"
354396,,,,"Allocapnia granulata","Common Snowfly",Iowa,Winneshiek,2008-03-13,,"Decorah Community Prairie",43.3015,-91.8025,"Kirk J. Larsen",adult,,,1,,,,,,,,,"Data from Kirk Larsen, Luther College"
354493,,,,"Strophopteryx fasciata","Mottled Willowfly",Iowa,Winneshiek,2008-03-13,,"Decorah Community Prairie",43.3015,-91.8025,"Kirk J. Larsen",adult,,,1,,,,,,,,,"Data from Kirk Larsen, Luther College"
354692,,,,"Strophopteryx fasciata","Mottled Willowfly",Iowa,Winneshiek,2008-04-13,,Decorah-x,43.30333,-91.78556,"Kirk J. Larsen",adult,,,1,,,,,,,,,"Data from Kirk Larsen, Luther College"
366626,,,,"Pteronarcys pictetii","Midwestern Salmonfly",Iowa,"Black Hawk",2024-06-02,15:45:18,"Along Brandon Rd-x",42.340402,-92.111972,"Greg Serafin",adult,Sighting,Photograph,1,,,,,,,,,
366936,,,,"Neoperla undetermined",None,Iowa,Linn,2024-06-13,20:40:40,"Palisades Kepler State Park",41.908442985,-91.502353318333,"Jim Durbin",adult,Blacklight/Fluorescent,Photograph,1,79,42,54,6,0,29.88,clear,"40 % visible",
366991,,,,"Isoperla bilineata",None,Iowa,Linn,2024-06-13,21:09:24,"Palisades Kepler State Park",41.908442985,-91.502353318333,"Jim Durbin",adult,Blacklight/Fluorescent,Photograph,1,79,42,54,6,0,29.88,clear,"40 % visible",
367115,,,,"Neoperla undetermined",None,Iowa,Linn,2024-06-15,20:44:14,"Hitaga Sand Ridge Prairie Preserve",42.250848798333,-91.632148993333,"Jim Durbin",adult,Blacklight/Fluorescent,Photograph,1,79,50,59,12,170,29.86,"partly cloudy","50% visible",
367146,,,,"Neoperla undetermined",None,Iowa,Linn,2024-06-15,20:54:20,"Hitaga Sand Ridge Prairie Preserve",42.250848798333,-91.632148993333,"Jim Durbin",adult,Blacklight/Fluorescent,Photograph,1,79,50,59,12,170,29.86,"partly cloudy","50% visible",
367459,,,,"Neoperla undetermined",None,Iowa,Linn,2024-06-21,20:27:17,"Palisades Kepler State Park",41.908421415,-91.502343391667,"Jim Durbin",adult,Blacklight/Fluorescent,Photograph,1,81,70,77,4,180,29.99,"partly cloudy","full moon",
