ID,"Collection / Source","Catalog Number","Specify Number",Taxon,"Common Name",State,County,Date,Time,Locale,Latitude,Longitude,Collector,"Life Stage","Collection Method","Preparation Type",Count,Temperature,Humidity,"Dew Point",Wind,"Wind Direction","Barometric Pressure",Sky,"Moon Phase",Notes
182493,,2017-000454,,"Osbornellus consors",None,Iowa,Johnson,2016-09-06,,Redacted,Redacted,Redacted,"Mark Brown",adult,,Photograph,1,,,,,,,,,
196322,,2017-014256,,"Osbornellus scalaris",None,Iowa,Linn,2017-09-14,1945-2230,"Hitaga Sand Ridge Prairie Preserve",42.250957,-91.632098,"Jim Durbin",adult,Blacklight/Fluorescent,Photograph,1,76,68,66,4,145,29.85,cloudy,"40 % visible",
202063,,2018-000209,,"Osbornellus clarus",None,Iowa,Johnson,2010-07-11,,"Iowa City Site 1",41.62806,-91.51417,"Mark Brown",adult,,Photograph,1,,,,,,,,,
234599,,,,"Osbornellus clarus",None,Iowa,Linn,2019-07-23,2100-2315,"Hitaga Sand Ridge Prairie Preserve",42.251284,-91.630087,"Jim Durbin",adult,Blacklight/Fluorescent,Photograph,1,75,56,58,3,275,30.11,clear,new,
238691,,,,"Osbornellus scalaris",None,Iowa,Linn,2019-09-30,1915-2200,"Hitaga Sand Ridge Prairie Preserve",42.250957,-91.632098,"Jim Durbin",adult,Blacklight/Fluorescent,Photograph,1,81,67,69,13,185,29.64,Clear,"0% visible",
238701,,,,"Osbornellus scalaris",None,Iowa,Linn,2019-09-30,1915-2200,"Hitaga Sand Ridge Prairie Preserve",42.250957,-91.632098,"Jim Durbin",adult,Blacklight/Fluorescent,Photograph,1,81,67,69,13,185,29.64,Clear,"0% visible",
238706,,,,"Osbornellus scalaris",None,Iowa,Linn,2019-09-30,1915-2200,"Hitaga Sand Ridge Prairie Preserve",42.250957,-91.632098,"Jim Durbin",adult,Blacklight/Fluorescent,Photograph,1,81,67,69,13,185,29.64,Clear,"0% visible",
238719,,,,"Osbornellus scalaris",None,Iowa,Linn,2019-09-05,"2000 - 2300","Wickiup Hill Outdoor Learning Area",42.087352,-91.767107,"Jim Durbin",adult,Blacklight/Fluorescent,Photograph,1,72,71,62,3,100,29.81,clear,"50% visible",
238721,,,,"Osbornellus scalaris",None,Iowa,Linn,2019-09-05,"2000 - 2300","Wickiup Hill Outdoor Learning Area",42.087352,-91.767107,"Jim Durbin",adult,Blacklight/Fluorescent,Photograph,1,72,71,62,3,100,29.81,clear,"50% visible",
238732,,,,"Osbornellus scalaris",None,Iowa,Linn,2019-09-05,"2000 - 2300","Wickiup Hill Outdoor Learning Area",42.087352,-91.767107,"Jim Durbin",adult,Blacklight/Fluorescent,Photograph,1,72,71,62,3,100,29.81,clear,"50% visible",
270009,,,,"Osbornellus auronitens-limosus-rotundus",None,Iowa,Linn,2020-08-08,20:53:00,"Hitaga Sand Ridge Prairie Preserve",42.25088607,-91.63213435,"Jim Durbin",adult,Blacklight/Fluorescent,Photograph,1,78,81,71,7,180,30.02,clear,"80% visible",
270938,,,,"Osbornellus scalaris",None,Iowa,Linn,2020-08-29,20:30:23,"Hitaga Sand Ridge Prairie Preserve",42.25085584,-91.63207192,"Jim Durbin",adult,Blacklight/Fluorescent,Photograph,1,64,64,52,5,350,29.91,clear,"90% visible",
270939,,,,"Osbornellus scalaris",None,Iowa,Linn,2020-08-29,20:30:10,"Hitaga Sand Ridge Prairie Preserve",42.25085584,-91.63207192,"Jim Durbin",adult,Blacklight/Fluorescent,Photograph,1,64,64,52,5,350,29.91,clear,"90% visible",
271003,,,,"Osbornellus scalaris",None,Iowa,Linn,2020-09-02,21:35:06,"Matsell Bridge Natural Area",42.13215415,-91.38528784,"Jim Durbin",adult,Blacklight/Fluorescent,Photograph,1,75,43,48,0,0,29.31,cxlear,"full moon",
271004,,,,"Osbornellus scalaris",None,Iowa,Linn,2020-09-02,21:35:03,"Matsell Bridge Natural Area",42.13215415,-91.38528784,"Jim Durbin",adult,Blacklight/Fluorescent,Photograph,1,75,43,48,0,0,29.31,cxlear,"full moon",
271313,,,,"Osbornellus auronitens-limosus-rotundus",None,Iowa,Story,2020-09-05,20:32:59,"Hertz Family Woods and Nature Preserve",41.98899391,-93.44316226,"Jim Durbin",adult,Blacklight/Fluorescent,Photograph,1,,,,,,,,,
271346,,,,"Osbornellus scalaris",None,Iowa,Story,2020-09-05,20:14:04,"Hertz Family Woods and Nature Preserve",41.98899391,-93.44316226,"Jim Durbin",adult,Blacklight/Fluorescent,Photograph,1,,,,,,,,,
272027,,,,"Osbornellus scalaris",None,Iowa,Linn,2020-09-16,20:04:06,"Hitaga Sand Ridge Prairie Preserve",42.25083834,-91.63212487,"Jim Durbin",adult,Sighting,Photograph,1,68,76,60,2,360,30.09,cloudy,"new moon",
272038,,,,"Osbornellus scalaris",None,Iowa,Linn,2020-09-16,20:08:39,"Hitaga Sand Ridge Prairie Preserve",42.25083834,-91.63212487,"Jim Durbin",adult,Sighting,Photograph,1,68,76,60,2,360,30.09,cloudy,"new moon",
289472,,,,"Osbornellus scalaris",None,Iowa,Linn,2021-06-27,21:39:37,"Pleasant Creek State Recreation Area, Linn County",42.1102396,-91.82752613,"Jim Durbin",adult,Sighting,Photograph,1,74,70,64,0,165,29.92,clear,"90% visible",
290126,,,,"Osbornellus scalaris",None,Iowa,Linn,2021-07-03,21:21:21,"Pinicon Ridge Park",42.21096962,-91.54429747,"Jim Durbin",adult,Blacklight/Fluorescent,Pinned,1,79,57,63,3,190,29.9,clear,"50% visible",
290566,,,,"Osbornellus clarus",None,Iowa,Linn,2021-07-08,21:51:51,"Hitaga Sand Ridge Prairie Preserve",42.25145774,-91.63021403,"Jim Durbin",adult,Blacklight/Fluorescent,Photograph,1,69,73,60,5,90,29.89,"partly cloudy","5% visible",
290583,,,,"Osbornellus undetermined",None,Iowa,Linn,2021-07-08,21:45:40,"Hitaga Sand Ridge Prairie Preserve",42.25145774,-91.63021403,"Jim Durbin",adult,Blacklight/Fluorescent,Photograph,1,69,73,60,5,90,29.89,"partly cloudy","5% visible",
291273,,,,"Osbornellus clarus",None,Iowa,Linn,2021-08-06,22:05:31,"Hitaga Sand Ridge Prairie Preserve",42.25082292,-91.63215158,"Jim Durbin",adult,Blacklight/Fluorescent,Photograph,1,78,72,68,4,165,29.79,cloudy,"new moon",
291394,,,,"Osbornellus scalaris",None,Iowa,Linn,2021-08-06,21:16:11,"Hitaga Sand Ridge Prairie Preserve",42.25082292,-91.63215158,"Jim Durbin",adult,Blacklight/Fluorescent,Photograph,1,78,72,68,4,165,29.79,cloudy,"new moon",
291702,,,,"Osbornellus scalaris",None,Iowa,Linn,2021-08-11,22:08:32,"Pleasant Creek State Recreation Area, Linn County",42.11043641,-91.82716239,"Jim Durbin",adult,Blacklight/Fluorescent,Photograph,1,84,66,72,6,270,29.66,"partly cloudy","10% visible",
291860,,,,"Osbornellus consors",None,Iowa,Linn,2021-08-11,20:45:50,"Pleasant Creek State Recreation Area, Linn County",42.11043641,-91.82716239,"Jim Durbin",adult,Blacklight/Fluorescent,Photograph,1,84,66,72,6,270,29.66,"partly cloudy","10% visible",
291967,,,,"Osbornellus scalaris",None,Iowa,Linn,2021-08-15,22:02:44,"Pinicon Ridge Park",42.21087488,-91.54432767,"Jim Durbin",adult,Blacklight/Fluorescent,Photograph,1,72,46,50,3,90,29.96,clear,"50% visible",
292079,,,,"Osbornellus scalaris",None,Iowa,Linn,2021-08-15,21:03:28,"Pinicon Ridge Park",42.21087488,-91.54432767,"Jim Durbin",adult,Blacklight/Fluorescent,Photograph,1,72,46,50,3,90,29.96,clear,"50% visible",
294945,,,,"Osbornellus scalaris",None,Iowa,Linn,2021-08-27,21:50:24,"Hitaga Sand Ridge Prairie Preserve",42.25082009,-91.63219999,"Jim Durbin",adult,Blacklight/Fluorescent,Photograph,1,85,80,78,4,90,29.93,clear,"80% visible",
294969,,,,"Osbornellus scalaris",None,Iowa,Linn,2021-08-27,21:44:08,"Hitaga Sand Ridge Prairie Preserve",42.25082009,-91.63219999,"Jim Durbin",adult,Blacklight/Fluorescent,Photograph,1,85,80,78,4,90,29.93,clear,"80% visible",
295054,,,,"Osbornellus scalaris",None,Iowa,Linn,2021-08-27,20:42:45,"Hitaga Sand Ridge Prairie Preserve",42.25082009,-91.63219999,"Jim Durbin",adult,Blacklight/Fluorescent,Photograph,1,85,80,78,4,90,29.93,clear,"80% visible",
297851,,,,"Osbornellus consors",None,Iowa,Johnson,2021-07-02,,Redacted,Redacted,Redacted,"Mark Brown",adult,Sighting,Photograph,1,,,,,,,,,
311651,,,,"Osbornellus scalaris",None,Iowa,Linn,2022-07-02,20:12:58,"Wanatee County Park",42.01013441,-91.56662262,"Jim Durbin",adult,Blacklight/Fluorescent,Photograph,1,72,61,58,3,190,30.02,clear,"10% moon",
312162,,,,"Osbornellus scalaris",None,Iowa,Linn,2022-07-18,22:11:27,"Wanatee County Park",42.01008617,-91.56657306,"Jim Durbin",adult,Sighting,Photograph,1,77,93,75,0,0,29.98,clear,"90% visible",
312475,,,,"Osbornellus scalaris",None,Iowa,Johnson,2022-07-23,21:08:21,"F. W. Kent Park",41.73491869,-91.72188289,"Jim Durbin",adult,Blacklight/Fluorescent,Pinned,1,88,65,74,12,190,29.81,cloudy,"40 % visible",
312507,,,,"Osbornellus scalaris",None,Iowa,Johnson,2022-07-23,20:32:36,"F. W. Kent Park",41.73491869,-91.72188289,"Jim Durbin",adult,Blacklight/Fluorescent,Pinned,1,88,65,74,12,190,29.81,cloudy,"40 % visible",
312509,,,,"Osbornellus scalaris",None,Iowa,Johnson,2022-07-23,20:28:23,"F. W. Kent Park",41.73491869,-91.72188289,"Jim Durbin",adult,Blacklight/Fluorescent,Pinned,1,88,65,74,12,190,29.81,cloudy,"40 % visible",
312681,,,,"Osbornellus scalaris",None,Iowa,Linn,2022-07-26,21:41:14,"Hitaga Sand Ridge Prairie Preserve",42.25103779,-91.63215575,"Jim Durbin",adult,Blacklight/Fluorescent,Photograph,1,76,79,69,1,170,29.91,cloudy,"10% moon",
312736,,,,"Osbornellus scalaris",None,Iowa,Linn,2022-07-26,20:57:02,"Hitaga Sand Ridge Prairie Preserve",42.25103779,-91.63215575,"Jim Durbin",adult,Blacklight/Fluorescent,Photograph,1,76,79,69,1,170,29.91,cloudy,"10% moon",
313070,,,,"Osbornellus scalaris",None,Iowa,Linn,2022-08-10,22:20:18,"Matsell Bridge Natural Area",42.13198835,-91.38532446,"Jim Durbin",adult,Blacklight/Fluorescent,Photograph,1,68,100,69,0,0,30.15,clear,full,
313102,,,,"Osbornellus scalaris",None,Iowa,Linn,2022-08-10,21:46:45,"Matsell Bridge Natural Area",42.13198835,-91.38532446,"Jim Durbin",adult,Blacklight/Fluorescent,Photograph,1,68,100,69,0,0,30.15,clear,full,
313203,,,,"Osbornellus scalaris",None,Iowa,Linn,2022-08-10,20:43:29,"Matsell Bridge Natural Area",42.13198835,-91.38532446,"Jim Durbin",adult,Blacklight/Fluorescent,Photograph,1,68,100,69,0,0,30.15,clear,full,
313683,,,,"Osbornellus scalaris",None,Iowa,Linn,2022-08-17,20:41:10,"Wanatee County Park",42.01012074,-91.56658753,"Jim Durbin",adult,Blacklight/Fluorescent,Photograph,1,68,91,65,0,0,30.08,clear,"80% visible",
313685,,,,"Osbornellus scalaris",None,Iowa,Linn,2022-08-17,20:39:28,"Wanatee County Park",42.01012074,-91.56658753,"Jim Durbin",adult,Blacklight/Fluorescent,Photograph,1,68,91,65,0,0,30.08,clear,"80% visible",
313687,,,,"Osbornellus scalaris",None,Iowa,Linn,2022-08-17,20:34:58,"Wanatee County Park",42.01012074,-91.56658753,"Jim Durbin",adult,Blacklight/Fluorescent,Photograph,1,68,91,65,0,0,30.08,clear,"80% visible",
313688,,,,"Osbornellus scalaris",None,Iowa,Linn,2022-08-17,20:32:49,"Wanatee County Park",42.01012074,-91.56658753,"Jim Durbin",adult,Blacklight/Fluorescent,Photograph,1,68,91,65,0,0,30.08,clear,"80% visible",
313985,,,,"Osbornellus scalaris",None,Iowa,Linn,2022-08-25,20:36:55,"Hitaga Sand Ridge Prairie Preserve",42.25103416,-91.63218888,"Jim Durbin",adult,Blacklight/Fluorescent,Photograph,1,73,90,70,2,350,30.03,clear,"10% visible",
314248,,,,"Osbornellus scalaris",None,Iowa,Johnson,2022-08-30,21:23:52,"F. W. Kent Park",41.73491755,-91.72195511,"Jim Durbin",adult,Blacklight/Fluorescent,Photograph,1,69,72,60,0,0,30.04,clear,"10% visible",
314302,,,,"Osbornellus scalaris",None,Iowa,Johnson,2022-08-30,21:03:21,"F. W. Kent Park",41.73491755,-91.72195511,"Jim Durbin",adult,Blacklight/Fluorescent,Photograph,1,69,72,60,0,0,30.04,clear,"10% visible",
314355,,,,"Osbornellus scalaris",None,Iowa,Johnson,2022-08-30,20:46:54,"F. W. Kent Park",41.73491755,-91.72195511,"Jim Durbin",adult,Blacklight/Fluorescent,Photograph,1,69,72,60,0,0,30.04,clear,"10% visible",
332013,,,,"Osbornellus consors",None,Iowa,Johnson,2022-09-06,,Redacted,Redacted,Redacted,"Mark Brown",adult,Sighting,Photograph,1,,,,,,,,,
337131,,,,"Osbornellus scalaris",None,Iowa,Linn,2023-07-08,21:47:39,"Palisades Kepler State Park",41.90829802,-91.50242489,"Jim Durbin",adult,Blacklight/Fluorescent,Photograph,1,73,55,53,7,330,29.89,clear,"80% visible",
337361,,,,"Osbornellus scalaris",None,Iowa,Benton,2023-07-11,21:14:52,"Wildcat Bluff Recreational Area",42.19420145,-91.8821574,"Jim Durbin",adult,Blacklight/Fluorescent,Photograph,1,76,59,61,4,330,29.92,cloudy,"50% visible",
337722,,,,"Osbornellus consors",None,Iowa,Linn,2023-07-16,21:09:30,"Matsell Bridge Natural Area",42.13217249,-91.38522877,"Jim Durbin",adult,Blacklight/Fluorescent,Photograph,1,73,70,63,4,220,29.87,cloudy,"10% visible",
337782,,,,"Osbornellus consors",None,Iowa,Linn,2023-07-16,21:45:56,"Matsell Bridge Natural Area",42.13217249,-91.38522877,"Jim Durbin",adult,Blacklight/Fluorescent,Photograph,1,73,70,63,4,220,29.87,cloudy,"10% visible",
338175,,,,"Osbornellus scalaris",None,Iowa,Linn,2023-07-20,20:50:55,"Palisades Kepler State Park",41.90828891,-91.50245954,"Jim Durbin",adult,Blacklight/Fluorescent,Photograph,1,75,63,61,2,330,30,"partly cloudy","10% visible",
338406,,,,"Osbornellus scalaris",None,Iowa,Johnson,2023-07-22,21:02:39,"F. W. Kent Park",41.73493888,-91.7219024,"Jim Durbin",adult,Blacklight/Fluorescent,Photograph,1,76,70,65,0,0,29.89,"partly cloudy","10% moon",
338453,,,,"Osbornellus scalaris",None,Iowa,Johnson,2023-07-22,21:33:33,"F. W. Kent Park",41.73493888,-91.7219024,"Jim Durbin",adult,Blacklight/Fluorescent,Photograph,1,76,70,65,0,0,29.89,"partly cloudy","10% moon",
338608,,,,"Osbornellus scalaris",None,Iowa,Johnson,2023-07-22,20:36:42,"F. W. Kent Park",41.73493888,-91.7219024,"Jim Durbin",adult,Blacklight/Fluorescent,Photograph,1,76,70,65,0,0,29.89,"partly cloudy","10% moon",
338661,,,,"Osbornellus scalaris",None,Iowa,Linn,2023-07-25,20:57:02,"Pinicon Ridge Park",42.2108105,-91.54420598,"Jim Durbin",adult,Blacklight/Fluorescent,Photograph,1,85,71,75,4,110,29.8,"partly cloudy","40 % visible",
338864,,,,"Osbornellus scalaris",None,Iowa,Linn,2023-07-30,20:45:25,"Hitaga Sand Ridge Prairie Preserve",42.25109448,-91.63222102,"Jim Durbin",adult,Blacklight/Fluorescent,Photograph,1,75,76,67,0,0,30.08,"mostly clear","95% moon",
338885,,,,"Osbornellus scalaris",None,Iowa,Linn,2023-07-30,21:14:38,"Hitaga Sand Ridge Prairie Preserve",42.25109448,-91.63222102,"Jim Durbin",adult,Blacklight/Fluorescent,Photograph,1,75,76,67,0,0,30.08,"mostly clear","95% moon",
339103,,,,"Osbornellus auronitens-limosus-rotundus",None,Iowa,Linn,2023-08-02,20:53:41,"Wanatee County Park",42.00997111,-91.5665254,"Jim Durbin",adult,Blacklight/Fluorescent,Photograph,1,75,94,73,3,110,30,"partly cloudy",full,
340169,,,,"Osbornellus scalaris",None,Iowa,Linn,2023-08-15,20:34:30,"Matsell Bridge Natural Area",42.13218339,-91.38536314,"Jim Durbin",adult,Blacklight/Fluorescent,Photograph,1,67,87,63,1,330,30.04,clear,,
340185,,,,"Osbornellus scalaris",None,Iowa,Linn,2023-08-15,21:07:28,"Matsell Bridge Natural Area",42.13218339,-91.38536314,"Jim Durbin",adult,Blacklight/Fluorescent,Photograph,1,67,87,63,1,330,30.04,clear,,
340303,,,,"Osbornellus scalaris",None,Iowa,Linn,2023-08-20,20:21:08,"Pinicon Ridge Park",42.21852826,-91.53878734,"Jim Durbin",adult,Blacklight/Fluorescent,Photograph,1,87,73,77,2,360,30.09,"partly cloudy","10% visible",
341335,,,,"Osbornellus scalaris",None,Iowa,Linn,2023-09-05,20:05:52,"Wanatee County Park",42.010077715,-91.566528441667,"Jim Durbin",adult,Blacklight/Fluorescent,Photograph,1,84,63,70,13,180,29.73,cloudy,"80% moon",
341484,,,,"Osbornellus scalaris",None,Iowa,Linn,2023-09-08,20:09:48,"Pinicon Ridge Park",42.21893755,-91.53818983,"Jim Durbin",adult,Blacklight/Fluorescent,Photograph,1,74,41,49,7,15,30.09,clear,,
341509,,,,"Osbornellus scalaris",None,Iowa,Linn,2023-09-08,20:26:19,"Pinicon Ridge Park",42.21893755,-91.53818983,"Jim Durbin",adult,Blacklight/Fluorescent,Photograph,1,74,41,49,7,15,30.09,clear,,
341626,,,,"Osbornellus scalaris",None,Iowa,Linn,2023-10-01,19:43:19,"Palisades Kepler State Park",41.90828729,-91.50237809,"Jim Durbin",adult,Blacklight/Fluorescent,Photograph,1,81,50,57,11,160,30.15,clear,"50% visible",
341630,,,,"Osbornellus scalaris",None,Iowa,Linn,2023-10-01,19:58:13,"Palisades Kepler State Park",41.90828729,-91.50237809,"Jim Durbin",adult,Blacklight/Fluorescent,Photograph,1,81,50,57,11,160,30.15,clear,"50% visible",
341728,,,,"Osbornellus scalaris",None,Iowa,Linn,2023-09-29,19:44:24,"Hitaga Sand Ridge Prairie Preserve",42.250745948333,-91.632190941667,"Jim Durbin",adult,Blacklight/Fluorescent,Photograph,1,78,75,65,9,160,30.03,clear,,
367472,,,,"Osbornellus scalaris",None,Iowa,Linn,2024-06-21,20:32:23,"Palisades Kepler State Park",41.908421415,-91.502343391667,"Jim Durbin",adult,Blacklight/Fluorescent,Photograph,1,81,70,77,4,180,29.99,"partly cloudy","full moon",
