ID,"Collection / Source","Catalog Number","Specify Number",Taxon,"Common Name",State,County,Date,Time,Locale,Latitude,Longitude,Collector,"Life Stage","Collection Method","Preparation Type",Count,Temperature,Humidity,"Dew Point",Wind,"Wind Direction","Barometric Pressure",Sky,"Moon Phase",Notes
11111,"Jim Durbin Drawer 350",2014-011393,SPM019024,"Pelecinus polyturator","Pelecinid Wasp",Iowa,"Palo Alto",2010-08-06,,"Lost Island County Park",43.17582,-94.89189,"Jim Durbin",adult,Sighting,Pinned,1,,,,,,,,,
32299,"Jim Durbin Drawer 350",2014-032671,SPM009611,"Pelecinus polyturator","Pelecinid Wasp",Iowa,"Van Buren",2007-09-09,,"Indian Lake Park, Farmington",40.63518,-91.75017,"Jim Durbin",adult,Net,Sighting,1,,,,,,,,,
40595,"Jim Durbin Drawer 350",2014-040972,SPM001509,"Pelecinus polyturator","Pelecinid Wasp",Iowa,Lee,2004-08-28,,"Shimek State Forest, Donnellson Unit",40.64833,-91.68057,"Jim Durbin",adult,Blacklight,Pinned,1,,,,,,,,,
174252,,2016-039002,,"Pelecinus polyturator","Pelecinid Wasp",Iowa,Jones,2016-08-10,2030-2300,"Westphal Timber, Jones",42.13475,-90.9556,"Jim Durbin",adult,Blacklight/Fluorescent,Photograph,1,79,82,73,8,180,30.01,cloudy,"50% visible",
176352,,2016-041102,,"Pelecinus polyturator","Pelecinid Wasp",Iowa,Jones,2016-09-04,,"Westphal Timber, Jones",42.1349,-90.95348,"Jim Durbin",adult,Blacklight/Fluorescent,Photograph,1,,,,,,,,,
186068,,2017-004030,,"Pelecinus polyturator","Pelecinid Wasp",Iowa,Linn,2008-09-28,,"1460 Douglas Ct, Marion",42.040069,-91.590953,"Jim Durbin",adult,Blacklight/Fluorescent,Photograph,1,,,,,,,,,
196122,,2017-014086,,"Pelecinus polyturator","Pelecinid Wasp",Iowa,Linn,2017-08-30,2000-2300,"Hitaga Sand Ridge Prairie Preserve",42.250957,-91.632098,"Jim Durbin",adult,Blacklight/Fluorescent,Photograph,1,70,90,68,0,0,30.07,clear,"50% visible",
201550,,2017-019479,,"Pelecinus polyturator","Pelecinid Wasp",Iowa,Jefferson,2017-07-27,,"Jefferson County Park",40.98639,-91.99111,"Moni Hayne",adult,,Photograph,1,,,,,,,,,
201632,,2017-019561,,"Pelecinus polyturator","Pelecinid Wasp",Iowa,Jefferson,2017-07-27,,"Jefferson County Park",40.98639,-91.99111,"Moni Hayne",adult,,Photograph,1,,,,,,,,,
201646,,2017-019575,,"Pelecinus polyturator","Pelecinid Wasp",Iowa,Jefferson,2017-07-27,,"Jefferson County Park",40.98639,-91.99111,"Moni Hayne",adult,,Photograph,1,,,,,,,,,
268613,,,,"Pelecinus polyturator","Pelecinid Wasp",Iowa,Lucas,2019-08-31,13:20:00,Chariton,41.011365,-93.304862,"Carter Drake",adult,Sighting,Photograph,1,,,,,,,,,"Observed only, did not collect."
310012,,,,"Pelecinus polyturator","Pelecinid Wasp",Iowa,Linn,2014-08-08,2030-2300DST,"Pleasant Creek State Recreation Area, Linn County",42.110327,-91.822988,"Jim Durbin",adult,Blacklight/Fluorescent,Pinned,1,72-69,79,62,Calm,,30.04,Clear,,
313319,,,,"Pelecinus polyturator","Pelecinid Wasp",Iowa,Lee,2022-08-12,21:43:05,"Shimek State Forest, Donnellson Unit",40.649455,-91.68119,"Angella Moorehouse",adult,Blacklight/Fluorescent,Photograph,1,,,,,,,,,
319921,,,,"Pelecinus polyturator","Pelecinid Wasp",Iowa,Buchanan,2022-09-08,,"Fontana County Park",42.604744,-91.910551,"Jay Gilliam",adult,Sighting,Photograph,1,,,,,,,,,
331884,,,,"Pelecinus polyturator","Pelecinid Wasp",Iowa,Linn,2022-08-13,,"Hitaga Sand Ridge Prairie Preserve",42.251132,-91.633262,"Mark Brown",adult,Sighting,Photograph,1,,,,,,,,,
340310,,,,"Pelecinus polyturator","Pelecinid Wasp",Iowa,Linn,2023-08-20,20:37:05,"Pinicon Ridge Park",42.21852826,-91.53878734,"Jim Durbin",adult,Blacklight/Fluorescent,Photograph,1,87,73,77,2,360,30.09,"partly cloudy","10% visible",
348063,,,,"Pelecinus polyturator","Pelecinid Wasp",Iowa,Warren,2023-08-13,,"Summerset State Park, Banner Lakes",41.444887,-93.555934,"Mark Brown",adult,Sighting,Photograph,1,,,,,,,,,
358507,,,,"Pelecinus polyturator","Pelecinid Wasp",Iowa,Winneshiek,1967-09-15,,"Sand Canyon",43.30445,-91.729917,"David Ahrenholz",adult,,,1,,,,,,,,,"Data from Kirk Larsen, Luther College"
