ID,"Collection / Source","Catalog Number","Specify Number",Taxon,"Common Name",State,County,Date,Time,Locale,Latitude,Longitude,Collector,"Life Stage","Collection Method","Preparation Type",Count,Temperature,Humidity,"Dew Point",Wind,"Wind Direction","Barometric Pressure",Sky,"Moon Phase",Notes
162560,,2016-027305,,"Epiaeschna heros","Swamp Darner",Iowa,Cedar,2002-06-01,,"Cedar County",41.834614,-91.1353,"Bob Cruden",adult,Sighting,Sighting,1,,,,,,,,,"small wetland on fenceline"
265208,,,,"Epiaeschna heros","Swamp Darner",Iowa,Linn,2020-05-30,12:20:04,"1460 Douglas Ct, Marion",42.040069,-91.590953,"Jim Durbin",adult,Sighting,Photograph,1,70,,,,,,,,"Female appeared to be trying to lay eggs"
276888,,2020-001228,,"Epiaeschna heros","Swamp Darner",Iowa,Dallas,2020-07-16,,"Beaver Creek Bridge- Brenton Slough",41.742308,-93.824428,"Jay Gilliam",adult,Sighting,Photograph,1,,,,,,,,,"7965, 7981"
292233,"Odonate Central",,,"Epiaeschna heros","Swamp Darner",Iowa,Decatur,2008-07-09,,"Slip Bluff County Park",40.64923,-93.83936,"Aaron Brees",adult,Sighting,Photo,1,,,,,,,,,
292599,"Odonate Central",,,"Epiaeschna heros","Swamp Darner",Iowa,Muscatine,2010-05-03,,"Muscatine County",41.515859,-91.134919,rdrass18,adult,Sighting,Photo,1,,,,,,,,,
293547,"Odonate Central",,,"Epiaeschna heros","Swamp Darner",Iowa,Linn,2020-05-30,,"1460 Douglas Ct, Marion",42.040069,-91.590953,"Jim Durbin",adult,Sighting,Specimen,1,,,,,,,,,
294355,"Odonate Central",,,"Epiaeschna heros","Swamp Darner",Iowa,Dallas,2020-07-16,,"Beaver Creek Bridge- Brenton Slough",41.742238,-93.824519,"Jay Gilliam",adult,Sighting,Photo,1,,,,,,,,,
356635,,,,"Epiaeschna heros","Swamp Darner",Michigan,Oceana,1984-08-09,,"Lake Michigan Benona",43.58299,-86.524018,"Kirk J. Larsen",adult,,,1,,,,,,,,,"Data from Kirk Larsen, Luther College"
366652,,,,"Epiaeschna heros","Swamp Darner",Iowa,Linn,2024-05-31,12:51:22,"1460 Douglas Ct, Marion",42.040078328333,-91.590921773333,"Jim Durbin",adult,Sighting,Photograph,1,,,,,,,,,
