ID,"Collection / Source","Catalog Number","Specify Number",Taxon,"Common Name",State,County,Date,Time,Locale,Latitude,Longitude,Collector,"Life Stage","Collection Method","Preparation Type",Count,Temperature,Humidity,"Dew Point",Wind,"Wind Direction","Barometric Pressure",Sky,"Moon Phase",Notes
11512,"Frank Olsen Drawer 17",2014-011794,SPM037331,"Herpetogramma bipunctalis","Southern Beet Webworm Moth",Iowa,Clarke,2013-10-11,,"Red Fern Timber",40.98317,-93.75317,"Frank Olsen",adult,,Pinned,1,,,,,,,,,"Located at Iowa State"
29752,"Frank Olsen Drawer 17",2014-030112,SPM002972,"Herpetogramma bipunctalis","Southern Beet Webworm Moth",Iowa,Muscatine,2004-06-06,,"Wildcat Den State Park",41.4705,-90.88228,"Frank Olsen",adult,,Pinned,1,,,,,,,,,"Located at Iowa State"
29753,"Frank Olsen Drawer 17",2014-030113,SPM005566,"Herpetogramma bipunctalis","Southern Beet Webworm Moth",Iowa,Muscatine,2005-06-26,,"Wildcat Den State Park",41.4705,-90.88228,"Frank Olsen",adult,,Pinned,1,,,,,,,,,"Located at Iowa State"
29754,"Frank Olsen Drawer 17",2014-030114,SPM007905,"Herpetogramma bipunctalis","Southern Beet Webworm Moth",Iowa,Linn,2006-07-15,,"Palisades Kepler State Park",41.90833,-91.50238,"Frank Olsen",adult,,Pinned,1,,,,,,,,,"Located at Iowa State"
29755,"Jim Durbin Drawer 042",2014-030115,SPM009111,"Herpetogramma bipunctalis","Southern Beet Webworm Moth",Iowa,Linn,2007-07-26,,"J. Harold Ennis County Park",41.898484,-91.482798,"Jim Durbin",adult,Blacklight/Fluorescent,Pinned,1,,,,,,,,,
29756,"Jim Durbin Drawer 042",2014-030116,SPM011762,"Herpetogramma bipunctalis","Southern Beet Webworm Moth",Iowa,Linn,2008-08-01,,"Behren's Pond Woodland State Preserve",42.118214,-91.754324,"Jim Durbin",adult,Blacklight/Fluorescent,Pinned,1,,,,,,,,,
29757,"Jim Durbin Drawer 042",2014-030117,SPM012200,"Herpetogramma bipunctalis","Southern Beet Webworm Moth",Iowa,Linn,2008-08-11,,Redacted,Redacted,Redacted,"Jim Durbin",adult,Blacklight/Fluorescent,Pinned,1,,,,,,,,,
29758,"Jim Durbin Drawer 042",2014-030118,SPM031834,"Herpetogramma bipunctalis","Southern Beet Webworm Moth",Iowa,Fremont,2012-09-08,,"Waubonsie State Park",40.676,-95.689,"Tom Jantscher",adult,,Pinned,1,,,,,,,,,
29760,"Frank Olsen Drawer 17",2014-030120,SPM036670,"Herpetogramma bipunctalis","Southern Beet Webworm Moth",Iowa,"Cerro Gordo",2013-06-30,,"Hoffman Prairie",43.13306,-93.45667,"Frank Olsen",adult,,Pinned,1,,,,,,,,,"Located at Iowa State"
29761,,2014-030121,SPM037535,"Herpetogramma bipunctalis","Southern Beet Webworm Moth",Iowa,Kossuth,2013-09-28,,Algona,43.06998,-94.23295,"Matt Kenne",adult,,Sighting,1,,,,,,,,,
29762,"Frank Olsen Drawer 47",2014-030122,SPM037879,"Herpetogramma bipunctalis","Southern Beet Webworm Moth",Iowa,"Van Buren",2013-09-18,,"Shimek State Forest, Farmington Unit",40.6659,-91.73637,"Frank Olsen",adult,,Pinned,1,,,,,,,,,"Located at Iowa State"
29763,"Frank Olsen Drawer 47",2014-030123,SPM037880,"Herpetogramma bipunctalis","Southern Beet Webworm Moth",Iowa,Linn,2013-09-25,,"Matsell Bridge Natural Area",42.13131,-91.38886,"Frank Olsen",adult,,Pinned,1,,,,,,,,,"Located at Iowa State"
43035,"Frank Olsen Drawer 17",2014-043412,SPM036676,"Herpetogramma bipunctalis","Southern Beet Webworm Moth",Iowa,Linn,2013-10-02,,"Palisades Kepler State Park",41.90833,-91.50238,"Frank Olsen",adult,,Pinned,1,,,,,,,,,"Located at Iowa State"
49614,,2014-049995,SPM038879,"Herpetogramma bipunctalis","Southern Beet Webworm Moth",Iowa,Guthrie,2012-05-27,,"Whiterock Conservancy",41.80725,-94.64085,"Leland Searles",adult,,Photograph,1,,,,,,,,,
110863,,2015-001419,,"Herpetogramma bipunctalis","Southern Beet Webworm Moth",Iowa,Polk,2013-09-11,,Redacted,Redacted,Redacted,"Aaron Brees",adult,,Sighting,1,,,,,,,,,
110864,,2015-001420,,"Herpetogramma bipunctalis","Southern Beet Webworm Moth",Iowa,Polk,2013-09-25,,Redacted,Redacted,Redacted,"Aaron Brees",adult,,Sighting,1,,,,,,,,,
110865,,2015-001421,,"Herpetogramma bipunctalis","Southern Beet Webworm Moth",Iowa,Polk,2013-10-03,,Redacted,Redacted,Redacted,"Aaron Brees",adult,,Sighting,1,,,,,,,,,
132436,"Paul Martsching Collection",2015-023027,,"Herpetogramma bipunctalis","Southern Beet Webworm Moth",Iowa,Story,2015-09-15,,"Ames, Paul",42.02064,-93.623952,"Paul Martsching",adult,"Building Light",Pinned,1,,,,,,,,,
173203,,2016-037949,,"Herpetogramma bipunctalis","Southern Beet Webworm Moth",Iowa,Linn,2016-07-30,2100-2330,"Hitaga Sand Ridge Prairie Preserve",42.250957,-91.632098,"Jim Durbin",adult,Blacklight/Fluorescent,Photograph,1,72,87,68,0,0,29.92,"partly cloudy","10% visible",
174852,,2016-039602,,"Herpetogramma bipunctalis","Southern Beet Webworm Moth",Iowa,Linn,2016-08-21,2030-2300,"Hitaga Sand Ridge Prairie Preserve",42.250957,-91.632098,"Jim Durbin",adult,Blacklight/Fluorescent,Photograph,1,64,74,55,0,0,30,clear,"80% visible",
176750,,2016-041500,,"Herpetogramma bipunctalis","Southern Beet Webworm Moth",Iowa,Linn,2016-09-17,,"Hitaga Sand Ridge Prairie Preserve",42.250957,-91.632098,"Jim Durbin",adult,Blacklight/Fluorescent,Photograph,1,68,67,56,0,0,29.88,clear,"100% visible",
176959,"Paul Martsching Collection",2016-041709,,"Herpetogramma bipunctalis","Southern Beet Webworm Moth",Iowa,Story,2016-09-06,,"Ames, Paul",42.02064,-93.623952,"Paul Martsching",adult,"Building Light",Pinned,1,,,,,,,,,
176960,"Paul Martsching Collection",2016-041710,,"Herpetogramma bipunctalis","Southern Beet Webworm Moth",Iowa,Story,2016-09-05,,"Ames, Paul",42.02064,-93.623952,"Paul Martsching",adult,"Building Light",Pinned,1,,,,,,,,,
176962,"Paul Martsching Collection",2016-041712,,"Herpetogramma bipunctalis","Southern Beet Webworm Moth",Iowa,Story,2016-09-14,,"Ames, Paul",42.02064,-93.623952,"Paul Martsching",adult,"Building Light",Pinned,1,,,,,,,,,
176978,"Paul Martsching Collection",2016-041728,,"Herpetogramma bipunctalis","Southern Beet Webworm Moth",Iowa,Story,2016-08-25,,"Ames, Paul",42.02064,-93.623952,"Paul Martsching",adult,"Building Light",Pinned,1,,,,,,,,,
177257,,2016-042007,,"Herpetogramma bipunctalis","Southern Beet Webworm Moth",Kentucky,Daviess,2016-10-19,,"5031 Old Lyddane Bridge Road",37.746771,-87.185979,"Jim Durbin",adult,Blacklight/Fluorescent,Photograph,1,,,,,,,,,
180093,"Paul Martsching Collection",2016-044843,,"Herpetogramma bipunctalis","Southern Beet Webworm Moth",Iowa,Story,2016-10-02,,"Ames, Paul",42.02064,-93.623952,"Paul Martsching",adult,"Building Light",Pinned,1,,,,,,,,,
180094,"Paul Martsching Collection",2016-044844,,"Herpetogramma bipunctalis","Southern Beet Webworm Moth",Iowa,Story,2016-09-20,,"Ames, Paul",42.02064,-93.623952,"Paul Martsching",adult,"Building Light",Pinned,1,,,,,,,,,
180095,"Paul Martsching Collection",2016-044845,,"Herpetogramma bipunctalis","Southern Beet Webworm Moth",Iowa,Story,2016-09-21,,"Ames, Paul",42.02064,-93.623952,"Paul Martsching",adult,"Building Light",Pinned,1,,,,,,,,,
180096,"Paul Martsching Collection",2016-044846,,"Herpetogramma bipunctalis","Southern Beet Webworm Moth",Iowa,Story,2016-09-18,,"Ames, Paul",42.02064,-93.623952,"Paul Martsching",adult,"Building Light",Pinned,1,,,,,,,,,
180106,"Paul Martsching Collection",2016-044856,,"Herpetogramma bipunctalis","Southern Beet Webworm Moth",Iowa,Story,2016-09-23,,"Ames, Paul",42.02064,-93.623952,"Paul Martsching",adult,"Building Light",Pinned,1,,,,,,,,,
180107,"Paul Martsching Collection",2016-044857,,"Herpetogramma bipunctalis","Southern Beet Webworm Moth",Iowa,Story,2016-10-01,,"Ames, Paul",42.02064,-93.623952,"Paul Martsching",adult,"Building Light",Pinned,1,,,,,,,,,
180108,"Paul Martsching Collection",2016-044858,,"Herpetogramma bipunctalis","Southern Beet Webworm Moth",Iowa,Story,2016-09-16,,"Ames, Paul",42.02064,-93.623952,"Paul Martsching",adult,"Building Light",Pinned,1,,,,,,,,,
182547,,2017-000508,,"Herpetogramma bipunctalis","Southern Beet Webworm Moth",Iowa,Johnson,2016-10-18,,Redacted,Redacted,Redacted,"Mark Brown",adult,,Photograph,1,,,,,,,,,
225158,"Frank Olsen Drawer 17",2014-012934,SPM032523,"Herpetogramma bipunctalis","Southern Beet Webworm Moth",Iowa,Clarke,2012-09-09,,"Red Fern Timber",40.98317,-93.75317,"Frank Olsen",adult,,Pinned,1,,,,,,,,,"Located at Iowa State"
238626,,,,"Herpetogramma bipunctalis","Southern Beet Webworm Moth",Iowa,Linn,2019-09-30,1915-2200,"Hitaga Sand Ridge Prairie Preserve",42.250957,-91.632098,"Jim Durbin",adult,Blacklight/Fluorescent,Photograph,1,81,67,69,13,185,29.64,Clear,"0% visible",
238636,,,,"Herpetogramma bipunctalis","Southern Beet Webworm Moth",Iowa,Linn,2019-09-30,1915-2200,"Hitaga Sand Ridge Prairie Preserve",42.250957,-91.632098,"Jim Durbin",adult,Blacklight/Fluorescent,Photograph,1,81,67,69,13,185,29.64,Clear,"0% visible",
241731,"Frank Olsen Drawer 17",2019-010013,,"Herpetogramma bipunctalis","Southern Beet Webworm Moth",Iowa,Dubuque,2012-07-20,,"Catfish Creek State Preserve",42.4679,-90.6553,"Frank Olsen",,Blacklight/Fluorescent,Pinned,1,,,,,,,,,"Located at Iowa State"
270972,,,,"Herpetogramma bipunctalis","Southern Beet Webworm Moth",Iowa,Linn,2020-09-02,22:08:13,"Matsell Bridge Natural Area",42.13215415,-91.38528784,"Jim Durbin",adult,Blacklight/Fluorescent,Photograph,1,75,43,48,0,0,29.31,cxlear,"full moon",
271046,,,,"Herpetogramma bipunctalis","Southern Beet Webworm Moth",Iowa,Linn,2020-09-02,20:45:48,"Matsell Bridge Natural Area",42.13215415,-91.38528784,"Jim Durbin",adult,Blacklight/Fluorescent,Photograph,1,75,43,48,0,0,29.31,cxlear,"full moon",
271267,,,,"Herpetogramma bipunctalis","Southern Beet Webworm Moth",Iowa,Story,2020-09-05,20:55:46,"Hertz Family Woods and Nature Preserve",41.98899391,-93.44316226,"Jim Durbin",adult,Blacklight/Fluorescent,Photograph,1,,,,,,,,,
299010,,,,"Herpetogramma bipunctalis","Southern Beet Webworm Moth",Iowa,Johnson,2021-10-08,,Redacted,Redacted,Redacted,"Mark Brown",adult,"Building Light",Photograph,1,,,,,,,,,
302424,"Jim Durbin Drawer 042",2021-000616,,"Herpetogramma bipunctalis","Southern Beet Webworm Moth",Iowa,Clarke,2012-09-09,,"Red Fern Timber",40.983025,-93.751252,"Frank Olsen",adult,Blacklight/Florescent,Pinned,1,,,,,,,,,
341544,,,,"Herpetogramma bipunctalis","Southern Beet Webworm Moth",Iowa,Linn,2023-09-08,20:56:14,"Pinicon Ridge Park",42.21893755,-91.53818983,"Jim Durbin",adult,Blacklight/Fluorescent,Photograph,1,74,41,49,7,15,30.09,clear,,
341547,,,,"Herpetogramma bipunctalis","Southern Beet Webworm Moth",Iowa,Linn,2023-09-08,20:56:48,"Pinicon Ridge Park",42.21893755,-91.53818983,"Jim Durbin",adult,Blacklight/Fluorescent,Photograph,1,74,41,49,7,15,30.09,clear,,
341558,,,,"Herpetogramma bipunctalis","Southern Beet Webworm Moth",Iowa,Linn,2023-09-08,21:17:31,"Pinicon Ridge Park",42.21893755,-91.53818983,"Jim Durbin",adult,Blacklight/Fluorescent,Photograph,1,74,41,49,7,15,30.09,clear,,
341560,,,,"Herpetogramma bipunctalis","Southern Beet Webworm Moth",Iowa,Linn,2023-09-08,21:17:39,"Pinicon Ridge Park",42.21893755,-91.53818983,"Jim Durbin",adult,Blacklight/Fluorescent,Photograph,1,74,41,49,7,15,30.09,clear,,
