ID,"Collection / Source","Catalog Number","Specify Number",Taxon,"Common Name",State,County,Date,Time,Locale,Latitude,Longitude,Collector,"Life Stage","Collection Method","Preparation Type",Count,Temperature,Humidity,"Dew Point",Wind,"Wind Direction","Barometric Pressure",Sky,"Moon Phase",Notes
13911,,2014-014196,SPM003474,"Adoxophyes negundana","Shimmering Adoxophyes Moth",Iowa,Jasper,2003-05-15,,"Neal Smith National Wildlife Refuge",41.5678,-93.2675,"Keith Summerville",adult,,Pinned,1,,,,,,,,,
13913,"Jim Durbin Drawer 022",2014-014198,SPM019392,"Adoxophyes negundana","Shimmering Adoxophyes Moth",Kentucky,Daviess,2010-08-26,,"5031 Old Lyddane Bridge Road",37.746807,-87.185997,"Jim Durbin",adult,Blacklight/Fluorescent,Pinned,1,,,,,,,,,
13914,"Jim Durbin Drawer 022",2014-014199,SPM027658,"Adoxophyes negundana","Shimmering Adoxophyes Moth",Iowa,Story,2012-05-28,,"Hickory Grove Park",41.99218,-93.36679,"Jim Durbin",adult,Blacklight/Fluorescent,Pinned,1,,,,,,,,,
13915,,2014-014200,SPM027718,"Adoxophyes negundana","Shimmering Adoxophyes Moth",Iowa,Story,2012-05-28,,"Hickory Grove Park",41.99218,-93.36679,"Jim Durbin",adult,Blacklight/Fluorescent,Photograph,1,,,,,,,,,
67186,,2014-067791,,"Adoxophyes negundana","Shimmering Adoxophyes Moth",Iowa,Winneshiek,2012-08-01,,"100 Acre Wood-x",0,0,"MJ Hatfield",adult,,Photograph,1,,,,,,,,,
110711,,2015-001267,,"Adoxophyes negundana","Shimmering Adoxophyes Moth",Iowa,Polk,2013-08-25,,Redacted,Redacted,Redacted,"Aaron Brees",adult,,Sighting,1,,,,,,,,,
110712,,2015-001268,,"Adoxophyes negundana","Shimmering Adoxophyes Moth",Iowa,Polk,2013-08-27,,Redacted,Redacted,Redacted,"Aaron Brees",adult,,Sighting,1,,,,,,,,,
133404,"Paul Martsching Collection",2015-023998,,"Adoxophyes negundana","Shimmering Adoxophyes Moth",Iowa,Story,2009-07-01,,"Ames, Paul",42.02064,-93.623952,"Paul Martsching",adult,"Building Light",Pinned,1,,,,,,,,,
133405,"Paul Martsching Collection",2015-023999,,"Adoxophyes negundana","Shimmering Adoxophyes Moth",Iowa,Story,2003-08-25,,"Ames, Paul",42.02064,-93.623952,"Paul Martsching",adult,"Building Light",Pinned,1,,,,,,,,,
146520,,2016-011147,,"Adoxophyes negundana","Shimmering Adoxophyes Moth",Iowa,Winneshiek,2015-06-07,,"100 Acre Wood-x",0,0,"MJ Hatfield",adult,,Photograph,1,,,,,,,,,
168383,,2016-033128,,"Adoxophyes negundana","Shimmering Adoxophyes Moth",Iowa,Story,2007-08-03,,"Ames, Paul",42.02064,-93.62395,"Paul Martsching",adult,"Building Light",,1,,,,,,,,,
168384,,2016-033129,,"Adoxophyes negundana","Shimmering Adoxophyes Moth",Iowa,Story,2008-07-22,,"Ames, Paul",42.02064,-93.62395,"Paul Martsching",adult,"Building Light",,1,,,,,,,,,
175385,"Paul Martsching Collection",2016-040135,,"Adoxophyes negundana","Shimmering Adoxophyes Moth",Iowa,Story,2016-07-26,,"Ames, Paul",42.02064,-93.623952,"Paul Martsching",adult,"Building Light",Pinned,1,,,,,,,,,
192996,,2017-010961,,"Adoxophyes negundana","Shimmering Adoxophyes Moth",Iowa,Linn,2017-07-01,,"Hitaga Sand Ridge Prairie Preserve",42.250957,-91.632098,"Jim Durbin",adult,Blacklight/Fluorescent,Photograph,1,72,56,55,280,9,29.97,clear,,
195315,,2017-013279,,"Adoxophyes negundana","Shimmering Adoxophyes Moth",Iowa,Linn,2017-08-14,2030-2300,"Hitaga Sand Ridge Prairie Preserve",42.250957,-91.632098,"Jim Durbin",adult,Blacklight/Fluorescent,Photograph,1,72,97,71,0,0,29.81,clear,"60% visible",
195367,,2017-013331,,"Adoxophyes negundana","Shimmering Adoxophyes Moth",Iowa,Linn,2017-08-14,2030-2300,"Hitaga Sand Ridge Prairie Preserve",42.250957,-91.632098,"Jim Durbin",adult,Blacklight/Fluorescent,Photograph,1,72,97,71,0,0,29.81,clear,"60% visible",
195466,,2017-013430,,"Adoxophyes negundana","Shimmering Adoxophyes Moth",Iowa,Linn,2017-08-14,2030-2300,"Hitaga Sand Ridge Prairie Preserve",42.250957,-91.632098,"Jim Durbin",adult,Blacklight/Fluorescent,Photograph,1,72,97,71,0,0,29.81,clear,"60% visible",
195494,,2017-013458,,"Adoxophyes negundana","Shimmering Adoxophyes Moth",Iowa,Linn,2017-08-14,2030-2300,"Hitaga Sand Ridge Prairie Preserve",42.250957,-91.632098,"Jim Durbin",adult,Blacklight/Fluorescent,Photograph,1,72,97,71,0,0,29.81,clear,"60% visible",
219526,,2018-017682,,"Adoxophyes negundana","Shimmering Adoxophyes Moth",Iowa,Linn,2018-08-25,2015-2300,"Hitaga Sand Ridge Prairie Preserve",42.250604,-91.629962,"Jim Durbin",adult,Blacklight/Fluorescent,Photograph,1,74,97,73,3,310,29.91,cdlear,"Full Moon",
219568,,2018-017724,,"Adoxophyes negundana","Shimmering Adoxophyes Moth",Iowa,Linn,2018-08-25,2015-2300,"Hitaga Sand Ridge Prairie Preserve",42.250604,-91.629962,"Jim Durbin",adult,Blacklight/Fluorescent,Photograph,1,74,97,73,3,310,29.91,cdlear,"Full Moon",
222959,"Paul Martsching Collection",2018-021113,,"Adoxophyes negundana","Shimmering Adoxophyes Moth",Iowa,Story,2018-07-23,,"Ames, Paul",42.02064,-93.623952,"Paul Martsching",adult,"Building Light",Pinned,1,,,,,,,,,
235144,,,,"Adoxophyes negundana","Shimmering Adoxophyes Moth",Iowa,Linn,2019-08-02,2100-2315,"Hitaga Sand Ridge Prairie Preserve",42.251284,-91.630087,"Jim Durbin",adult,Sighting,Photograph,1,70,67,58,1,90,30.02,clar,dark,
235178,,,,"Adoxophyes negundana","Shimmering Adoxophyes Moth",Iowa,Linn,2019-08-02,2100-2315,"Hitaga Sand Ridge Prairie Preserve",42.251284,-91.630087,"Jim Durbin",adult,Sighting,Photograph,1,70,67,58,1,90,30.02,clar,dark,
235206,,,,"Adoxophyes negundana","Shimmering Adoxophyes Moth",Iowa,Linn,2019-08-02,2100-2315,"Hitaga Sand Ridge Prairie Preserve",42.251284,-91.630087,"Jim Durbin",adult,Sighting,Photograph,1,70,67,58,1,90,30.02,clar,dark,
235248,,,,"Adoxophyes negundana","Shimmering Adoxophyes Moth",Iowa,Linn,2019-08-02,2100-2315,"Hitaga Sand Ridge Prairie Preserve",42.251284,-91.630087,"Jim Durbin",adult,Sighting,Photograph,1,70,67,58,1,90,30.02,clar,dark,
236365,,,,"Adoxophyes negundana","Shimmering Adoxophyes Moth",Iowa,Linn,2019-08-17,2030-2300,"Hitaga Sand Ridge Prairie Preserve",42.25226,-91.63040167,"Jim Durbin",adult,Blacklight/Fluorescent,Photograph,1,79,62,65,1,180,29.71,"parthly cloudy","Full Moon",
239706,"Paul Martsching Collection",2019-009385,,"Adoxophyes negundana","Shimmering Adoxophyes Moth",Iowa,Story,2019-08-05,330,"Ames, Paul",42.02064,-93.623952,"Paul Martsching",adult,"Building Light",Pinned,1,,,,,,,,,
265849,,,,"Adoxophyes negundana","Shimmering Adoxophyes Moth",Iowa,Linn,2020-06-07,21:52:16,"Wickiup Hill Outdoor Learning Area",42.08736536,-91.76707659,"Jim Durbin",adult,Sighting,Photograph,1,81,49,60,4,170,29.77,clear,full,
268865,,,,"Adoxophyes negundana","Shimmering Adoxophyes Moth",Iowa,Linn,2020-07-24,22:12:04,"Wickiup Hill Outdoor Learning Area",42.08807239,-91.76755076,"Jim Durbin",adult,Blacklight/Fluorescent,Photograph,1,80,76,72,4,120,29.6,clear,"20% visible",
269877,,,,"Adoxophyes negundana","Shimmering Adoxophyes Moth",Iowa,Linn,2020-08-08,21:46:55,"Hitaga Sand Ridge Prairie Preserve",42.25088607,-91.63213435,"Jim Durbin",adult,Blacklight/Fluorescent,Photograph,1,78,81,71,7,180,30.02,clear,"80% visible",
269931,,,,"Adoxophyes negundana","Shimmering Adoxophyes Moth",Iowa,Linn,2020-08-08,21:20:24,"Hitaga Sand Ridge Prairie Preserve",42.25088607,-91.63213435,"Jim Durbin",adult,Blacklight/Fluorescent,Photograph,1,78,81,71,7,180,30.02,clear,"80% visible",
274697,"Frank Olsen Drawer 49",2020-000713,,"Adoxophyes negundana","Shimmering Adoxophyes Moth",Iowa,Linn,2008-09-19,,"Pleasant Creek State Recreation Area, Linn County",42.11952,-91.81215,"Frank Olsen",adult,,Pinned,1,,,,,,,,,"Located at Iowa State"
288449,,,,"Adoxophyes negundana","Shimmering Adoxophyes Moth",Iowa,Linn,2021-06-12,22:27:22,"Pleasant Creek State Recreation Area, Linn County",42.11007461,-91.82771882,"Jim Durbin",adult,Blacklight/Fluorescent,Photograph,1,78,30,45,4,0,29.88,clear,"10% visible",
288492,,,,"Adoxophyes negundana","Shimmering Adoxophyes Moth",Iowa,Linn,2021-06-12,22:10:50,"Pleasant Creek State Recreation Area, Linn County",42.11007461,-91.82771882,"Jim Durbin",adult,Blacklight/Fluorescent,Photograph,1,78,30,45,4,0,29.88,clear,"10% visible",
288512,,,,"Adoxophyes negundana","Shimmering Adoxophyes Moth",Iowa,Linn,2021-06-12,22:02:58,"Pleasant Creek State Recreation Area, Linn County",42.11007461,-91.82771882,"Jim Durbin",adult,Blacklight/Fluorescent,Photograph,1,78,30,45,4,0,29.88,clear,"10% visible",
288785,,,,"Adoxophyes negundana","Shimmering Adoxophyes Moth",Iowa,Linn,2021-06-18,22:46:58,"Hitaga Sand Ridge Prairie Preserve",42.25091805,-91.63221484,"Jim Durbin",adult,Blacklight/Fluorescent,Photograph,1,84,46,61,4,180,29.75,"partly cloudy","50% visible",
289005,,,,"Adoxophyes negundana","Shimmering Adoxophyes Moth",Iowa,Linn,2021-06-18,21:49:31,"Hitaga Sand Ridge Prairie Preserve",42.25091805,-91.63221484,"Jim Durbin",adult,Blacklight/Fluorescent,Photograph,1,84,46,61,4,180,29.75,"partly cloudy","50% visible",
289007,,,,"Adoxophyes negundana","Shimmering Adoxophyes Moth",Iowa,Linn,2021-06-18,21:49:21,"Hitaga Sand Ridge Prairie Preserve",42.25091805,-91.63221484,"Jim Durbin",adult,Blacklight/Fluorescent,Photograph,1,84,46,61,4,180,29.75,"partly cloudy","50% visible",
291175,,,,"Adoxophyes negundana","Shimmering Adoxophyes Moth",Iowa,Linn,2021-08-06,22:42:12,"Hitaga Sand Ridge Prairie Preserve",42.25082292,-91.63215158,"Jim Durbin",adult,Blacklight/Fluorescent,Photograph,1,78,72,68,4,165,29.79,cloudy,"new moon",
291670,,,,"Adoxophyes negundana","Shimmering Adoxophyes Moth",Iowa,Linn,2021-08-11,22:19:17,"Pleasant Creek State Recreation Area, Linn County",42.11043641,-91.82716239,"Jim Durbin",adult,Blacklight/Fluorescent,Photograph,1,84,66,72,6,270,29.66,"partly cloudy","10% visible",
291691,,,,"Adoxophyes negundana","Shimmering Adoxophyes Moth",Iowa,Linn,2021-08-11,22:13:47,"Pleasant Creek State Recreation Area, Linn County",42.11043641,-91.82716239,"Jim Durbin",adult,Blacklight/Fluorescent,Photograph,1,84,66,72,6,270,29.66,"partly cloudy","10% visible",
291810,,,,"Adoxophyes negundana","Shimmering Adoxophyes Moth",Iowa,Linn,2021-08-11,21:08:56,"Pleasant Creek State Recreation Area, Linn County",42.11043641,-91.82716239,"Jim Durbin",adult,Blacklight/Fluorescent,Photograph,1,84,66,72,6,270,29.66,"partly cloudy","10% visible",
308948,"Jim Durbin Drawer 022",2022-000220,,"Adoxophyes negundana","Shimmering Adoxophyes Moth",Iowa,"Van Buren",2012-06-10,,"Shimek State Forest, Farmington Unit",40.665362,-91.737169,"Frank Olsen",adult,Blacklighting,Pinned,1,,,,,,,,,
315879,,,SPM027664,"Adoxophyes negundana","Shimmering Adoxophyes Moth",Iowa,Story,2012-05-28,,"Hickory Grove Park",41.99218,-93.36679,"Jim Durbin",adult,Blacklight/Fluorescent,Photograph,1,,,,,,,,,
355837,,,,Adoxophyes,None,Iowa,Winneshiek,2018-08-07,,"Hickory Ridge Woods",43.3178,-91.7959,"Lena Schmitt",adult,,,1,,,,,,,,,"Data from Kirk Larsen, Luther College"
