ID,"Collection / Source","Catalog Number","Specify Number",Taxon,"Common Name",State,County,Date,Time,Locale,Latitude,Longitude,Collector,"Life Stage","Collection Method","Preparation Type",Count,Temperature,Humidity,"Dew Point",Wind,"Wind Direction","Barometric Pressure",Sky,"Moon Phase",Notes
11843,,2014-012125,SPM040968,"Epiblema boxcana",None,Iowa,Linn,2014-06-17,,"Pleasant Creek State Recreation Area, Linn County",42.10948,-91.8249,"Jim Durbin",adult,Blacklight/Fluorescent,Photograph,1,,,,,,,,,
11895,,2014-012177,SPM041116,"Epiblema boxcana",None,Iowa,Guthrie,2014-06-20,,"Whiterock Conservancy",41.8201,-94.64768,"Jim Durbin",adult,Blacklight/Fluorescent,Photograph,1,,,,,,,,,
25371,"Jim Durbin Drawer 015",2014-025718,SPM012575,"Epiblema boxcana",None,Iowa,Linn,2008-08-17,,Redacted,Redacted,Redacted,"Jim Durbin",adult,Blacklight/Fluorescent,Pinned,1,,,,,,,,,
25372,"Jim Durbin Drawer 015",2014-025719,SPM012577,"Epiblema boxcana",None,Iowa,Linn,2008-08-17,,Redacted,Redacted,Redacted,"Jim Durbin",adult,Blacklight/Fluorescent,Pinned,1,,,,,,,,,
25373,"Jim Durbin Drawer 015",2014-025720,SPM017683,"Epiblema boxcana",None,Iowa,Linn,2010-05-26,,"Wanatee County Park",42.01026,-91.57381,"Jim Durbin",adult,Blacklight/Fluorescent,Pinned,1,,,,,,,,,
25374,"Jim Durbin Drawer 015",2014-025721,SPM018260,"Epiblema boxcana",None,Iowa,Linn,2010-06-29,,"Wickiup Hill Outdoor Learning Area",42.08398,-91.7651,"Jim Durbin",adult,Blacklight/Fluorescent,Pinned,1,,,,,,,,,
25375,"Jim Durbin Drawer 015",2014-025722,SPM022132,"Epiblema boxcana",None,Iowa,Linn,2011-06-14,,"Wickiup Hill Outdoor Learning Area",42.08398,-91.7651,"Jim Durbin",adult,Blacklight/Fluorescent,Pinned,1,,,,,,,,,
25376,,2014-025723,SPM022280,"Epiblema boxcana",None,Iowa,Linn,2011-06-20,,"Wickiup Hill Outdoor Learning Area",42.08398,-91.7651,"Jim Durbin",adult,Blacklight/Fluorescent,Photograph,1,,,,,,,,,
25377,,2014-025724,SPM030668,"Epiblema boxcana",None,Iowa,Linn,2012-07-19,,"Wanatee County Park",42.01026,-91.57381,"Jim Durbin",adult,Blacklight/Fluorescent,Photograph,1,,,,,,,,,
25379,,2014-025726,SPM035078,"Epiblema boxcana",None,Iowa,Guthrie,2013-07-12,,"Whiterock Conservancy",41.80725,-94.64085,"Jim Durbin",adult,Blacklight/Fluorescent,Photograph,1,,,,,,,,,
25380,,2014-025727,SPM035086,"Epiblema boxcana",None,Iowa,Guthrie,2013-07-12,,"Whiterock Conservancy",41.80725,-94.64085,"Jim Durbin",adult,Blacklight/Fluorescent,Photograph,1,,,,,,,,,
25381,,2014-025728,SPM036227,"Epiblema boxcana",None,Iowa,Linn,2013-08-21,,"Matsell Bridge Natural Area",42.13131,-91.38886,"Jim Durbin",adult,Blacklight/Fluorescent,Photograph,1,,,,,,,,,
25382,,2014-025729,SPM036248,"Epiblema boxcana",None,Iowa,Linn,2013-08-21,,"Matsell Bridge Natural Area",42.13131,-91.38886,"Jim Durbin",adult,Blacklight/Fluorescent,Photograph,1,,,,,,,,,
25383,,2014-025730,SPM039174,"Epiblema boxcana",None,Iowa,Jefferson,2012-07-23,,"Jefferson County Park",40.993,-91.987,"Moni Hayne",adult,Blacklight/Fluorescent,Pinned,1,,,,,,,,,
25384,"Jim Durbin Drawer 015",2014-025731,SPM039861,"Epiblema boxcana",None,Iowa,Linn,2014-05-29,,"Pinicon Ridge Park",42.21028,-91.54417,"Jim Durbin",adult,Blacklight/Fluorescent,Pinned,1,,,,,,,,,
66634,,2014-067239,,"Epiblema boxcana",None,Iowa,Winneshiek,2012-09-03,,"100 Acre Wood-x",0,0,"MJ Hatfield",adult,,Photograph,1,,,,,,,,,
66639,,2014-067244,,"Epiblema boxcana",None,Iowa,Winneshiek,2012-09-03,,"100 Acre Wood-x",0,0,"MJ Hatfield",adult,,Photograph,1,,,,,,,,,
130568,,2015-021158,,"Epiblema boxcana",None,Iowa,Johnson,2015-05-29,,Redacted,Redacted,Redacted,"Mark Brown",adult,,Photograph,1,,,,,,,,,
133340,"Paul Martsching Collection",2015-023934,,"Epiblema boxcana",None,Iowa,Story,2014-08-30,,"Ames, Paul",42.02064,-93.623952,"Paul Martsching",adult,"Building Light",Pinned,1,,,,,,,,,
143655,,2016-008396,,"Epiblema boxcana",None,Iowa,Johnson,2015-05-29,,Redacted,Redacted,Redacted,"Mark Brown",adult,,Photograph,1,,,,,,,,,
146063,,2016-010690,,"Epiblema boxcana",None,Iowa,Winneshiek,2012-09-03,,"100 Acre Wood-x",0,0,"MJ Hatfield",adult,,Photograph,1,,,,,,,,,
146066,,2016-010693,,"Epiblema boxcana",None,Iowa,Winneshiek,2012-09-03,,"100 Acre Wood-x",0,0,"MJ Hatfield",adult,,Photograph,1,,,,,,,,,
192231,,2017-010192,,"Epiblema boxcana",None,Iowa,Linn,2017-06-03,2030-2330,"Wickiup Hill Outdoor Learning Area",42.087567,-91.767578,"Jim Durbin",adult,Blacklight/Fluorescent,Photograph,1,83,44,59,4,280,29.88,clear,"60% visible",
196039,,2017-014003,,"Epiblema boxcana",None,Iowa,Linn,2017-08-30,2000-2300,"Hitaga Sand Ridge Prairie Preserve",42.250957,-91.632098,"Jim Durbin",adult,Blacklight/Fluorescent,Photograph,1,70,90,68,0,0,30.07,clear,"50% visible",
198716,"Paul Martsching Collection",2017-016650,,"Epiblema boxcana",None,Iowa,Story,2017-09-02,,"Ames, Paul",42.02064,-93.62395,"Paul Martsching",adult,"Building Light",Pinned,1,,,,,,,,,
198717,"Paul Martsching Collection",2017-016651,,"Epiblema boxcana",None,Iowa,Story,2017-09-02,,"Ames, Paul",42.02064,-93.62395,"Paul Martsching",adult,"Building Light",Pinned,1,,,,,,,,,
208196,,2018-006361,,"Epiblema boxcana",None,Iowa,Winneshiek,2017-09-09,,"100 Acre Wood-x",0,0,"MJ Hatfield",adult,,Photograph,1,,,,,,,,,
208197,,2018-006362,,"Epiblema boxcana",None,Iowa,Winneshiek,2017-09-09,,"100 Acre Wood-x",0,0,"MJ Hatfield",adult,,Photograph,1,,,,,,,,,
211365,,2018-009522,,"Epiblema boxcana",None,Iowa,Linn,2018-05-30,"2045 - 2315","Hitaga Sand Ridge Prairie Preserve",42.25095,-91.63209,"Jim Durbin",adult,Blacklight/Fluorescent,Photograph,1,77,56,60,7,270,29.59,"partly cloudy",full,
211681,,2018-009838,,"Epiblema boxcana",None,Iowa,Linn,2018-06-06,2030-2315,"Wickiup Hill Outdoor Learning Area",42.087352,-91.767107,"Jim Durbin",adult,Blacklight/Fluorescent,Photograph,1,74,69,64,5,280,29.83,cloudy,"50% visible",
211738,,2018-009895,,"Epiblema boxcana",None,Iowa,Linn,2018-06-06,2030-2315,"Wickiup Hill Outdoor Learning Area",42.087352,-91.767107,"Jim Durbin",adult,Blacklight/Fluorescent,Photograph,1,74,69,64,5,280,29.83,cloudy,"50% visible",
215986,,2018-014142,,"Epiblema boxcana",None,Iowa,Winneshiek,2018-06-12,,"100 Acre Wood-x",0,0,"MJ Hatfield",adult,"Blacklight Trap",Photograph,1,,,,,,,,,
223312,,2018-021434,,"Epiblema boxcana",None,Iowa,Kossuth,2018-05-31,,"Union Slough National Wildlife Refuge",43.23852,-94.15303,"Matt Kenne",adult,,Sighting,1,,,,,,,,,
225721,,2018-014143,,"Epiblema boxcana",None,Iowa,Winneshiek,2018-06-12,,"100 Acre Wood-x",0,0,"MJ Hatfield",adult,"Blacklight Trap",Photograph,1,,,,,,,,,
231900,,2019-006613,,"Epiblema boxcana",None,Iowa,Linn,2019-06-17,2100-2300,"Hitaga Sand Ridge Prairie Preserve",42.250957,-91.632098,"Jim Durbin",adult,Blacklight/Fluorescent,Photograph,1,71,68,60,5,110,29.97,cloudy,full,
231993,,2019-006706,,"Epiblema boxcana",None,Iowa,Linn,2019-06-17,2100-2300,"Hitaga Sand Ridge Prairie Preserve",42.250957,-91.632098,"Jim Durbin",adult,Blacklight/Fluorescent,Photograph,1,71,68,60,5,110,29.97,cloudy,full,
265255,,,,"Epiblema boxcana",None,Iowa,Linn,2020-06-01,21:34:37,"Rehrauer Natural Area",42.2551662,-91.4885161,"Jim Durbin",adult,Blacklight/Fluorescent,Photograph,1,,,,,,,,,
265741,,,,"Epiblema boxcana",None,Iowa,Linn,2020-06-05,22:21:10,"Hitaga Sand Ridge Prairie Preserve",42.25088607,-91.63212362,"Jim Durbin",adult,Blacklight/Fluorescent,Photograph,1,75,58,59,4,355,29.95,clear,Full,
265761,,,,"Epiblema boxcana",None,Iowa,Linn,2020-06-05,22:21:10,"Hitaga Sand Ridge Prairie Preserve",42.25088607,-91.63212362,"Jim Durbin",adult,Blacklight/Fluorescent,Photograph,1,75,58,59,4,355,29.95,clear,Full,
267870,,,,"Epiblema boxcana",None,Iowa,Linn,2020-06-28,22:19:49,"Wickiup Hill Outdoor Learning Area",42.08735076,-91.76706884,"Jim Durbin",adult,Blacklight/Fluorescent,Photograph,1,78,76,70,4,110,29.57,clear,"50% visible",
267871,,,,"Epiblema boxcana",None,Iowa,Linn,2020-06-28,22:19:45,"Wickiup Hill Outdoor Learning Area",42.08735076,-91.76706884,"Jim Durbin",adult,Blacklight/Fluorescent,Photograph,1,78,76,70,4,110,29.57,clear,"50% visible",
268045,,,,"Epiblema boxcana",None,Iowa,Linn,2020-06-28,21:50:56,"Wickiup Hill Outdoor Learning Area",42.08735076,-91.76706884,"Jim Durbin",adult,Blacklight/Fluorescent,Photograph,1,78,76,70,4,110,29.57,clear,"50% visible",
268075,,,,"Epiblema boxcana",None,Iowa,Linn,2020-06-28,21:42:26,"Wickiup Hill Outdoor Learning Area",42.08735076,-91.76706884,"Jim Durbin",adult,Blacklight/Fluorescent,Photograph,1,78,76,70,4,110,29.57,clear,"50% visible",
269290,,,,"Epiblema boxcana",None,Iowa,Linn,2020-06-12,20:48:25,"Hitaga Sand Ridge Prairie Preserve",42.250917,-91.632103,"Jim Durbin",adult,Sighting,Photograph,1,,,,,,,,,
288163,,,,"Epiblema boxcana",None,Iowa,Linn,2021-06-02,22:33:29,"Hitaga Sand Ridge Prairie Preserve",42.25092585,-91.63217796,"Jim Durbin",adult,Blacklight/Fluorescent,Photograph,1,65,69,55,,,29.91,clear,"6% visible",
290410,,,,"Epiblema boxcana",None,Iowa,Linn,2021-07-08,22:19:08,"Hitaga Sand Ridge Prairie Preserve",42.25145774,-91.63021403,"Jim Durbin",adult,Blacklight/Fluorescent,Photograph,1,69,73,60,5,90,29.89,"partly cloudy","5% visible",
311498,,,,"Epiblema boxcana",None,Iowa,Linn,2022-07-02,21:27:43,"Wanatee County Park",42.01013441,-91.56662262,"Jim Durbin",adult,Blacklight/Fluorescent,Photograph,1,72,61,58,3,190,30.02,clear,"10% moon",
313501,,,,"Epiblema boxcana",None,Iowa,Linn,2022-08-17,22:38:40,"Wanatee County Park",42.01012074,-91.56658753,"Jim Durbin",adult,Blacklight/Fluorescent,Photograph,1,68,91,65,0,0,30.08,clear,"80% visible",
314279,,,,"Epiblema boxcana",None,Iowa,Johnson,2022-08-30,21:12:52,"F. W. Kent Park",41.73491755,-91.72195511,"Jim Durbin",adult,Blacklight/Fluorescent,Photograph,1,69,72,60,0,0,30.04,clear,"10% visible",
336119,,,,"Epiblema boxcana",None,Iowa,Linn,2023-06-29,21:59:00,"Indian Creek Nature Center",41.96608977,-91.58982624,"Jim Durbin",adult,Blacklight/Fluorescent,Photograph,1,76,92,74,0,330,29.88,hazy,"50% visible",
348217,,,,"Epiblema boxcana",None,Iowa,Johnson,2023-08-23,21:42:57,Redacted,Redacted,Redacted,"Mark Brown",adult,Sighting,Photograph,1,,,,,,,,,
367021,,,,"Epiblema boxcana",None,Iowa,Linn,2024-06-13,21:24:35,"Palisades Kepler State Park",41.908442985,-91.502353318333,"Jim Durbin",adult,Blacklight/Fluorescent,Photograph,1,79,42,54,6,0,29.88,clear,"40 % visible",
