ID,"Collection / Source","Catalog Number","Specify Number",Taxon,"Common Name",State,County,Date,Time,Locale,Latitude,Longitude,Collector,"Life Stage","Collection Method","Preparation Type",Count,Temperature,Humidity,"Dew Point",Wind,"Wind Direction","Barometric Pressure",Sky,"Moon Phase",Notes
133579,"Paul Martsching Collection",2015-024173,,"Neodactria murellus",None,Iowa,Story,2006-06-21,,"Ames, Paul",42.02064,-93.623952,"Paul Martsching",adult,"Building Light",Pinned,1,,,,,,,,,
133580,"Paul Martsching Collection",2015-024174,,"Neodactria murellus",None,Iowa,Story,2005-07-09,,"Ames, Paul",42.02064,-93.623952,"Paul Martsching",adult,"Building Light",Pinned,1,,,,,,,,,
133581,"Paul Martsching Collection",2015-024175,,"Neodactria murellus",None,Iowa,Story,2006-07-18,,"Ames, Paul",42.02064,-93.623952,"Paul Martsching",adult,"Building Light",Pinned,1,,,,,,,,,
175588,"Paul Martsching Collection",2016-040338,,"Neodactria murellus",None,Iowa,Story,2016-06-16,,"Ames, Paul",42.02064,-93.623952,"Paul Martsching",adult,"Building Light",Pinned,1,,,,,,,,,
175589,"Paul Martsching Collection",2016-040339,,"Neodactria murellus",None,Iowa,Story,2016-06-18,,"Ames, Paul",42.02064,-93.623952,"Paul Martsching",adult,"Building Light",Pinned,1,,,,,,,,,
175590,"Paul Martsching Collection",2016-040340,,"Neodactria murellus",None,Iowa,Story,2016-06-28,,"Ames, Paul",42.02064,-93.623952,"Paul Martsching",adult,"Building Light",Pinned,1,,,,,,,,,
175593,"Paul Martsching Collection",2016-040343,,"Neodactria murellus",None,Iowa,Story,2016-07-12,,"Ames, Paul",42.02064,-93.623952,"Paul Martsching",adult,"Building Light",Pinned,1,,,,,,,,,
198753,"Paul Martsching Collection",2017-016687,,"Neodactria murellus",None,Iowa,Story,2017-06-04,,"Ames, Paul",42.02064,-93.62395,"Paul Martsching",adult,"Building Light",Pinned,1,,,,,,,,,
198756,"Paul Martsching Collection",2017-016690,,"Neodactria murellus",None,Iowa,Story,2017-07-06,,"Ames, Paul",42.02064,-93.62395,"Paul Martsching",adult,"Building Light",Pinned,1,,,,,,,,,
198757,"Paul Martsching Collection",2017-016691,,"Neodactria murellus",None,Iowa,Story,2017-07-11,,"Ames, Paul",42.02064,-93.62395,"Paul Martsching",adult,"Building Light",Pinned,1,,,,,,,,,
222838,"Paul Martsching Collection",2018-020992,,"Neodactria murellus",None,Iowa,Story,2018-06-13,,"Ames, Paul",42.02064,-93.623952,"Paul Martsching",adult,"Building Light",Pinned,1,,,,,,,,,
238796,,,,"Neodactria murellus",None,Iowa,Johnson,2019-09-19,,Redacted,Redacted,Redacted,"Mark Brown",adult,"Building Light",Photograph,1,,,,,,,,,
238797,,,,"Neodactria murellus",None,Iowa,Johnson,2019-09-19,,Redacted,Redacted,Redacted,"Mark Brown",adult,"Building Light",Photograph,1,,,,,,,,,
239613,"Paul Martsching Collection",2019-009292,,"Neodactria murellus",None,Iowa,Story,2019-06-28,330,"Ames, Paul",42.02064,-93.623952,"Paul Martsching",adult,"Building Light",Pinned,1,,,,,,,,,
239615,"Paul Martsching Collection",2019-009294,,"Neodactria murellus",None,Iowa,Story,2019-06-28,330,"Ames, Paul",42.02064,-93.623952,"Paul Martsching",adult,"Building Light",Pinned,1,,,,,,,,,
278401,,,,"Neodactria murellus",None,Iowa,Story,2020-06-30,,"Ames, Paul",42.012366,-93.613528,"Paul Martsching",adult,Sighting,Sighting,1,,,,,,,,,
295035,,,,"Neodactria murellus",None,Iowa,Linn,2021-08-27,20:57:11,"Hitaga Sand Ridge Prairie Preserve",42.25082009,-91.63219999,"Jim Durbin",adult,Blacklight/Fluorescent,Photograph,1,85,80,78,4,90,29.93,clear,"80% visible",
296463,,,,"Neodactria murellus",None,Iowa,Johnson,2021-08-28,5:45:15,Redacted,Redacted,Redacted,"Mark Brown",adult,Sighting,Photograph,1,,,,,,,,,
299188,"Paul Martsching Collection",2021-000412,,"Neodactria murellus",None,Iowa,Story,2021-06-19,500,"Ames, Paul",42.02064,-93.623952,"Paul Martsching",adult,"Building Light",Pinned,1,69,,,10,0,,"mostly clear",,
299189,"Paul Martsching Collection",2021-000413,,"Neodactria murellus",None,Iowa,Story,2021-06-19,500,"Ames, Paul",42.02064,-93.623952,"Paul Martsching",adult,"Building Light",Pinned,1,69,,,10,0,,"mostly clear",,
302356,"Jim Durbin Drawer 044",2021-000545,,"Neodactria murellus",None,Iowa,Linn,2013-06-25,,"1460 Douglas Ct, Marion",42.040069,-91.590953,"Jim Durbin",adult,Blacklight/Florescent,Pinned,1,,,,,,,,,
308821,"Jim Durbin Drawer 044",2022-000094,,"Neodactria murellus",None,Iowa,Linn,2014-09-19,,"Pinicon Ridge Park",42.212734,-91.548126,"Frank Olsen",adult,Blacklighting,Pinned,1,,,,,,,,,
347647,,,,"Neodactria murellus",None,Iowa,Johnson,2023-08-17,23:15:29,Redacted,Redacted,Redacted,"Mark Brown",adult,Sighting,Photograph,1,,,,,,,,,
348732,,,,"Neodactria murellus",None,Iowa,Johnson,2023-09-08,22:13:40,Redacted,Redacted,Redacted,"Mark Brown",adult,Sighting,Photograph,1,,,,,,,,,
