ID,"Collection / Source","Catalog Number","Specify Number",Taxon,"Common Name",State,County,Date,Time,Locale,Latitude,Longitude,Collector,"Life Stage","Collection Method","Preparation Type",Count,Temperature,Humidity,"Dew Point",Wind,"Wind Direction","Barometric Pressure",Sky,"Moon Phase",Notes
5786,,2014-006067,,"Satyrium titus","Coral Hairstreak",Iowa,Winneshiek,1950-07-01,,"Winneshiek County",43.236259,-91.909927," USGS - NPWRC",adult,Sighting,Sighting,1,,,,,,,,,"HIstorical Record"
261758,,,,"Satyrium titus","Coral Hairstreak",Iowa,Winneshiek,2019-08-13,17:00,"Seed Saver Exchange",43.382467,-91.801188,IBSN,adult,Sighting,Sighting,2,85,,,"Relatively Still",,,"Partly Cloudy",,
353238,,,,"Satyrium titus","Coral Hairstreak",Iowa,Winneshiek,2014-07-10,,"Anderson Prairie, Decorah",43.315099,-91.800701,"Emma Stivers",adult,,,1,,,,,,,,,"Data from Kirk Larsen, Luther College"
354198,,,,"Satyrium titus","Coral Hairstreak",Iowa,Winneshiek,2015-07-07,,"Chipera Prairie Park",43.1325,-92.0075,"Jacob Wittman",adult,,,1,,,,,,,,,"Data from Kirk Larsen, Luther College"
354199,,,,"Satyrium titus","Coral Hairstreak",Iowa,Winneshiek,2015-07-07,,"Chipera Prairie Park",43.1325,-92.0075,"Kirk J. Larsen",adult,,,1,,,,,,,,,"Data from Kirk Larsen, Luther College"
355100,,,,"Satyrium titus","Coral Hairstreak",Iowa,Winneshiek,2020-07-07,,"Falcon Springs State Wildlife Area",43.3445,-91.8695,"Kayla Gibson",adult,,,1,,,,,,,,,"Data from Kirk Larsen, Luther College"
355477,,,,"Satyrium titus","Coral Hairstreak",Iowa,Winneshiek,2015-07-07,,"Spilde Woods",43.317783,-91.812417,"Kirk J. Larsen",adult,,,1,,,,,,,,,"Data from Kirk Larsen, Luther College"
357373,,,,"Satyrium titus","Coral Hairstreak",Iowa,Winneshiek,2015-07-07,,"Ludwig Preserve",43.194,-91.979,"Kirk J. Larsen",adult,,,1,,,,,,,,,"Data from Kirk Larsen, Luther College"
