ID,"Collection / Source","Catalog Number","Specify Number",Taxon,"Common Name",State,County,Date,Time,Locale,Latitude,Longitude,Collector,"Life Stage","Collection Method","Preparation Type",Count,Temperature,Humidity,"Dew Point",Wind,"Wind Direction","Barometric Pressure",Sky,"Moon Phase",Notes
4037,,2014-004318,,"Tharsalea dione","Gray Copper",Iowa,Winneshiek,1950-07-01,,"Winneshiek County",43.236259,-91.909927," USGS - NPWRC",adult,Sighting,Sighting,1,,,,,,,,,"HIstorical Record"
57821,,2014-058203,,"Tharsalea dione","Gray Copper",Iowa,Winneshiek,1995-07-03,,"Winneshiek County",43.23626,-91.90993,"Kirk Larsen",adult,Sighting,Sighting,1,,,,,,,,,
57822,,2014-058204,,"Tharsalea dione","Gray Copper",Iowa,Winneshiek,1998-06-30,,"Winneshiek County",43.23626,-91.90993,"Kirk Larsen",adult,Sighting,Sighting,1,,,,,,,,,
138388,,2016-002933,,"Tharsalea dione","Gray Copper",Iowa,Winneshiek,2005-07-03,,"Plymouth Rock-x",0,0,"MJ Hatfield",adult,Sighting,Photograph,1,,,,,,,,,
246888,,,,"Tharsalea dione","Gray Copper",Iowa,Winneshiek,2001-06-29,,"Seed Saver Exchange",43.385026,-91.808464,"Frank Olsen",,Sighting,Sighting,3,,,,,,,,,
304832,,,,"Tharsalea dione","Gray Copper",Iowa,Winneshiek,2021-07-03,13:00,"Decorah Community Prairie",43.300937,-91.803306,IBSN,adult,Sighting,Sighting,1,84,,,,,,Hazy,,
353018,,,,"Lycaena dione","Gray Copper",Iowa,Winneshiek,1995-07-03,,"Anderson Prairie, Decorah",43.315099,-91.800701,"Kirk J. Larsen",adult,,,1,,,,,,,,,"Data from Kirk Larsen, Luther College"
353903,,,,"Lycaena dione","Gray Copper",Iowa,Winneshiek,1998-06-30,,"Chattahoochie County Park",43.316617,-91.816283,"Kirk J. Larsen",adult,,,1,,,,,,,,,"Data from Kirk Larsen, Luther College"
353904,,,,"Lycaena dione","Gray Copper",Iowa,Winneshiek,1998-06-30,,"Chattahoochie County Park",43.316617,-91.816283,"Kirk J. Larsen",adult,,,1,,,,,,,,,"Data from Kirk Larsen, Luther College"
355398,,,,"Lycaena dione","Gray Copper",Iowa,Winneshiek,2015-07-07,,"Spilde Woods",43.317783,-91.812417,"Emma Stivers",adult,,,1,,,,,,,,,"Data from Kirk Larsen, Luther College"
355541,,,,"Lycaena dione","Gray Copper",Iowa,Winneshiek,2020-06-24,,"Spilde Woods",43.317783,-91.812417,"Kayla Gibson",adult,,,1,,,,,,,,,"Data from Kirk Larsen, Luther College"
358924,,,,"Lycaena dione","Gray Copper",Iowa,Winneshiek,2011-06-28,,"US-52 Project",43.3122,-91.814625,"Kirk J. Larsen",adult,,,1,,,,,,,,,"Data from Kirk Larsen, Luther College"
