ID,"Collection / Source","Catalog Number","Specify Number",Taxon,"Common Name",State,County,Date,Time,Locale,Latitude,Longitude,Collector,"Life Stage","Collection Method","Preparation Type",Count,Temperature,Humidity,"Dew Point",Wind,"Wind Direction","Barometric Pressure",Sky,"Moon Phase",Notes
13797,"Frank Olsen Drawer 32",2014-014079,SPM002115,"Actias luna","Luna Moth",Iowa,"Van Buren",2003-06-21,,"Shimek State Forest, Farmington Unit",40.64802,-91.7254,"Doug Veal",adult,,Pinned,1,,,,,,,,,"Located at Iowa State"
13804,"Frank Olsen Drawer 32",2014-014086,SPM007350,"Actias luna","Luna Moth",Iowa,"Van Buren",2006-08-04,,"Shimek State Forest, Farmington Unit",40.64802,-91.7254,"Doug Veal",adult,,Pinned,1,,,,,,,,,"Located at Iowa State"
13805,,2014-014087,SPM007942,"Actias luna","Luna Moth",Iowa,"Van Buren",2003-05-30,,"Shimek State Forest, Farmington Unit",40.64802,-91.7254,"Doug Veal",adult,,Sighting,1,,,,,,,,,
13808,,2014-014090,SPM013504,"Actias luna","Luna Moth",Iowa,"Van Buren",2004-08-22,,"Shimek State Forest, Farmington Unit",40.64802,-91.7254,"Frank Olsen",adult,,Sighting,1,,,,,,,,,
13815,,2014-014097,SPM013511,"Actias luna","Luna Moth",Iowa,"Van Buren",2004-05-21,,"Shimek State Forest, Farmington Unit",40.64802,-91.7254,"Doug Veal",adult,,Sighting,1,,,,,,,,,
13816,,2014-014098,SPM013512,"Actias luna","Luna Moth",Iowa,"Van Buren",2003-08-16,,"Shimek State Forest, Farmington Unit",40.64802,-91.7254,"Doug Veal",adult,,Sighting,1,,,,,,,,,
13818,,2014-014100,SPM013514,"Actias luna","Luna Moth",Iowa,"Van Buren",2003-06-21,,"Shimek State Forest, Farmington Unit",40.64802,-91.7254,"Doug Veal",adult,,Sighting,1,,,,,,,,,
13835,,2014-014117,SPM017389,"Actias luna","Luna Moth",Iowa,"Van Buren",2010-05-04,,"Shimek State Forest, Farmington Unit",40.64802,-91.7254,"Ed Freese",adult,,Sighting,1,,,,,,,,,
13837,,2014-014119,SPM017803,"Actias luna","Luna Moth",Iowa,"Van Buren",2010-05-04,,"Shimek State Forest, Farmington Unit",40.64802,-91.7254,"Ed Freese",adult,,Sighting,1,,,,,,,,,
13842,,2014-014124,SPM020298,"Actias luna","Luna Moth",Iowa,"Van Buren",2004-08-22,,"Shimek State Forest, Farmington Unit",40.64802,-91.7254,"Frank Olsen",adult,,Sighting,1,,,,,,,,,
13843,,2014-014125,SPM020946,"Actias luna","Luna Moth",Iowa,"Van Buren",2004-08-22,,"Shimek State Forest, Farmington Unit",40.64802,-91.7254,"Frank Olsen",adult,,Sighting,1,,,,,,,,,
15595,"Frank Olsen Drawer 27",2014-015891,SPM031777,"Anisota virginiensis","Pink-striped Oakworm Moth",Iowa,"Van Buren",2012-06-10,,"Shimek State Forest, Farmington Unit",40.6659,-91.73637,"Frank Olsen",adult,,Pinned,1,,,,,,,,,"Located at Iowa State"
15731,"Frank Olsen Drawer 32",2014-016027,SPM002119,"Antheraea polyphemus","Polyphemus Moth",Iowa,"Van Buren",2003-05-30,,"Shimek State Forest, Farmington Unit",40.64802,-91.7254,"Doug Veal",adult,,Pinned,1,,,,,,,,,"Located at Iowa State"
15732,"Frank Olsen Drawer 32",2014-016028,SPM002120,"Antheraea polyphemus","Polyphemus Moth",Iowa,"Van Buren",2004-07-18,,"Shimek State Forest, Farmington Unit",40.64802,-91.7254,"Frank Olsen",adult,,Pinned,1,,,,,,,,,"Located at Iowa State"
15739,"Jim Durbin Drawer 081",2014-016035,SPM005818,"Antheraea polyphemus","Polyphemus Moth",Iowa,"Van Buren",2006-04-22,,"Lacey-Keosauqua State Park",40.71688,-91.9908,"Jim Durbin",adult,Blacklight/Fluorescent,Pinned,1,,,,,,,,,
15750,,2014-016046,SPM013495,"Antheraea polyphemus","Polyphemus Moth",Iowa,"Van Buren",2004-05-08,,"Shimek State Forest, Farmington Unit",40.64802,-91.7254,"Frank Olsen",adult,,Sighting,1,,,,,,,,,
15751,,2014-016047,SPM013496,"Antheraea polyphemus","Polyphemus Moth",Iowa,"Van Buren",2004-05-21,,"Shimek State Forest, Farmington Unit",40.64802,-91.7254,"Doug Veal",adult,,Sighting,1,,,,,,,,,
15754,,2014-016050,SPM013499,"Antheraea polyphemus","Polyphemus Moth",Iowa,"Van Buren",2003-06-21,,"Shimek State Forest, Farmington Unit",40.64802,-91.7254,"Doug Veal",adult,,Sighting,1,,,,,,,,,
15772,,2014-016068,SPM017388,"Antheraea polyphemus","Polyphemus Moth",Iowa,"Van Buren",2010-05-04,,"Shimek State Forest, Farmington Unit",40.64802,-91.7254,"Ed Freese",adult,,Sighting,1,,,,,,,,,
15773,,2014-016069,SPM017804,"Antheraea polyphemus","Polyphemus Moth",Iowa,"Van Buren",2010-05-04,,"Shimek State Forest, Farmington Unit",40.64802,-91.7254,"Ed Freese",adult,,Sighting,1,,,,,,,,,
15780,,2014-016076,SPM020949,"Antheraea polyphemus","Polyphemus Moth",Iowa,"Van Buren",2004-05-08,,"Shimek State Forest, Farmington Unit",40.64802,-91.7254,"Frank Olsen",adult,,Sighting,1,,,,,,,,,
15819,,2014-016115,SPM033696,"Antheraea polyphemus","Polyphemus Moth",Iowa,"Van Buren",2013-05-14,,"Shimek State Forest, Farmington Unit",40.6659,-91.73637,"Frank Olsen",adult,,Sighting,1,,,,,,,,,
17338,"Frank Olsen Drawer 32",2014-017637,SPM007336,"Automeris io","Io Moth",Iowa,"Van Buren",2006-06-15,,"Shimek State Forest, Farmington Unit",40.64802,-91.7254,"Frank Olsen",adult,,Pinned,1,,,,,,,,,"Located at Iowa State"
17339,,2014-017638,SPM007940,"Automeris io","Io Moth",Iowa,"Van Buren",2003-06-21,,"Shimek State Forest, Farmington Unit",40.64802,-91.7254,"Doug Veal",adult,,Sighting,1,,,,,,,,,
17344,,2014-017643,SPM013486,"Automeris io","Io Moth",Iowa,"Van Buren",2003-06-21,,"Shimek State Forest, Farmington Unit",40.64802,-91.7254,"Doug Veal",adult,,Sighting,1,,,,,,,,,
17345,,2014-017644,SPM013487,"Automeris io","Io Moth",Iowa,"Van Buren",2003-06-21,,"Shimek State Forest, Farmington Unit",40.64802,-91.7254,"Doug Veal",adult,,Sighting,1,,,,,,,,,
17359,"Frank Olsen Drawer 32",2014-017658,SPM031811,"Automeris io","Io Moth",Iowa,"Van Buren",2012-06-10,,"Shimek State Forest, Farmington Unit",40.6659,-91.73637,"Frank Olsen",adult,,Pinned,1,,,,,,,,,"Located at Iowa State"
24167,"Frank Olsen Drawer 27",2014-024513,SPM002202,"Dryocampa rubicunda","Rosy Maple Moth",Iowa,"Van Buren",2003-08-02,,"Shimek State Forest, Farmington Unit",40.64802,-91.7254,"Frank Olsen",adult,,Pinned,1,,,,,,,,,"Located at Iowa State"
24290,"Frank Olsen Drawer 32",2014-024636,SPM002117,"Eacles imperialis","Imperial Moth",Iowa,"Van Buren",2003-08-02,,"Shimek State Forest, Farmington Unit",40.64802,-91.7254,"Frank Olsen",adult,,Pinned,1,,,,,,,,,"Located at Iowa State"
24291,"Frank Olsen Drawer 32",2014-024637,SPM002118,"Eacles imperialis","Imperial Moth",Iowa,"Van Buren",2003-07-25,,"Shimek State Forest, Farmington Unit",40.64802,-91.7254,"Doug Veal",adult,,Pinned,1,,,,,,,,,"Located at Iowa State"
24295,,2014-024641,SPM007938,"Eacles imperialis","Imperial Moth",Iowa,"Van Buren",2003-07-26,,"Shimek State Forest, Farmington Unit",40.64802,-91.7254,"Doug Veal",adult,,Pinned,1,,,,,,,,,"Located at Iowa State"
24296,,2014-024642,SPM007939,"Eacles imperialis","Imperial Moth",Iowa,"Van Buren",2003-07-26,,"Shimek State Forest, Farmington Unit",40.64802,-91.7254,"Doug Veal",adult,,Pinned,1,,,,,,,,,"Located at Iowa State"
24302,,2014-024648,SPM013475,"Eacles imperialis","Imperial Moth",Iowa,"Van Buren",2003-07-26,,"Shimek State Forest, Farmington Unit",40.64802,-91.7254,"Doug Veal",adult,,Pinned,1,,,,,,,,,"Located at Iowa State"
24303,,2014-024649,SPM013476,"Eacles imperialis","Imperial Moth",Iowa,"Van Buren",2003-08-16,,"Shimek State Forest, Farmington Unit",40.64802,-91.7254,"Doug Veal",adult,,Pinned,1,,,,,,,,,"Located at Iowa State"
24336,,2014-024683,SPM020948,"Eacles imperialis","Imperial Moth",Iowa,"Van Buren",2004-07-18,,"Shimek State Forest, Farmington Unit",40.64802,-91.7254,"Frank Olsen",adult,,Sighting,1,,,,,,,,,
30384,"Frank Olsen Drawer 32",2014-030744,SPM002116,"Hyalophora cecropia","Cecropia Moth",Iowa,"Van Buren",2003-06-21,,"Shimek State Forest, Farmington Unit",40.64802,-91.7254,"Doug Veal",adult,,Pinned,1,,,,,,,,,"Located at Iowa State"
46467,"Frank Olsen Drawer 27",2014-046844,SPM002397,"Syssphinx bicolor","Honey Locust Moth",Iowa,"Van Buren",2004-05-08,,"Shimek State Forest, Farmington Unit",40.64802,-91.7254,"Doug Veal",adult,,Pinned,1,,,,,,,,,"Located at Iowa State"
46468,"Frank Olsen Drawer 27",2014-046845,SPM002398,"Syssphinx bicolor","Honey Locust Moth",Iowa,"Van Buren",2004-05-08,,"Shimek State Forest, Farmington Unit",40.64802,-91.7254,"Frank Olsen",adult,,Pinned,1,,,,,,,,,"Located at Iowa State"
46469,"Frank Olsen Drawer 27",2014-046846,SPM002399,"Syssphinx bicolor","Honey Locust Moth",Iowa,"Van Buren",2003-05-30,,"Shimek State Forest, Farmington Unit",40.64802,-91.7254,"Doug Veal",adult,,Pinned,1,,,,,,,,,"Located at Iowa State"
46470,"Frank Olsen Drawer 27",2014-046847,SPM002400,"Syssphinx bicolor","Honey Locust Moth",Iowa,"Van Buren",2003-05-30,,"Shimek State Forest, Farmington Unit",40.64802,-91.7254,"Doug Veal",adult,,Pinned,1,,,,,,,,,"Located at Iowa State"
46472,"Frank Olsen Drawer 27",2014-046849,SPM002402,"Syssphinx bicolor","Honey Locust Moth",Iowa,"Van Buren",2003-08-02,,"Shimek State Forest, Farmington Unit",40.64802,-91.7254,"Frank Olsen",adult,,Pinned,1,,,,,,,,,"Located at Iowa State"
46473,"Frank Olsen Drawer 27",2014-046850,SPM002403,"Syssphinx bicolor","Honey Locust Moth",Iowa,"Van Buren",2003-08-02,,"Shimek State Forest, Farmington Unit",40.64802,-91.7254,"Frank Olsen",adult,,Pinned,1,,,,,,,,,"Located at Iowa State"
46474,"Frank Olsen Drawer 27",2014-046851,SPM002404,"Syssphinx bicolor","Honey Locust Moth",Iowa,"Van Buren",2004-07-18,,"Shimek State Forest, Farmington Unit",40.64802,-91.7254,"Frank Olsen",adult,,Pinned,1,,,,,,,,,"Located at Iowa State"
46475,"Frank Olsen Drawer 27",2014-046852,SPM002405,"Syssphinx bicolor","Honey Locust Moth",Iowa,"Van Buren",2004-07-18,,"Shimek State Forest, Farmington Unit",40.64802,-91.7254,"Frank Olsen",adult,,Pinned,1,,,,,,,,,"Located at Iowa State"
46476,"Frank Olsen Drawer 27",2014-046853,SPM002406,"Syssphinx bicolor","Honey Locust Moth",Iowa,"Van Buren",2003-08-02,,"Shimek State Forest, Farmington Unit",40.64802,-91.7254,"Frank Olsen",adult,,Pinned,1,,,,,,,,,"Located at Iowa State"
46497,"Jim Durbin Drawer 077",2014-046874,SPM005934,"Syssphinx bicolor","Honey Locust Moth",Iowa,"Van Buren",2006-05-06,,"Lacey-Keosauqua State Park",40.71688,-91.9908,"Jim Durbin",adult,Blacklight/Fluorescent,Pinned,1,,,,,,,,,
46498,"Jim Durbin Drawer 077",2014-046875,SPM005937,"Syssphinx bicolor","Honey Locust Moth",Iowa,"Van Buren",2006-05-06,,"Lacey-Keosauqua State Park",40.71688,-91.9908,"Jim Durbin",adult,Blacklight/Fluorescent,Pinned,1,,,,,,,,,
46534,"Frank Olsen Drawer 27",2014-046911,SPM024383,"Syssphinx bicolor","Honey Locust Moth",Iowa,"Van Buren",2011-05-10,,"Shimek State Forest, Farmington Unit",40.6659,-91.73637,"Frank Olsen",adult,,Pinned,1,,,,,,,,,"Located at Iowa State"
46535,"Frank Olsen Drawer 27",2014-046912,SPM024384,"Syssphinx bicolor","Honey Locust Moth",Iowa,"Van Buren",2011-05-10,,"Shimek State Forest, Farmington Unit",40.6659,-91.73637,"Frank Olsen",adult,,Pinned,1,,,,,,,,,"Located at Iowa State"
46559,,2014-046936,SPM033592,"Syssphinx bicolor","Honey Locust Moth",Iowa,"Van Buren",2013-05-06,,"Shimek State Forest, Farmington Unit",40.6659,-91.73637,"Jim Durbin",adult,Blacklight/Fluorescent,Photograph,1,,,,,,,,,
46563,"Frank Olsen Drawer 27",2014-046940,SPM036564,"Syssphinx bicolor","Honey Locust Moth",Iowa,"Van Buren",2013-05-14,,"Shimek State Forest, Farmington Unit",40.6659,-91.73637,"Frank Olsen",adult,,Pinned,1,,,,,,,,,"Located at Iowa State"
46568,,2014-046945,SPM039274,"Syssphinx bicolor","Honey Locust Moth",Iowa,"Van Buren",2013-05-29,,"Lacey-Keosauqua State Park",40.71694,-91.99028,"Tom Jantscher",adult,,Sighting,1,,,,,,,,,
46569,,2014-046946,SPM039277,"Syssphinx bicolor","Honey Locust Moth",Iowa,"Van Buren",2013-05-29,,"Lacey-Keosauqua State Park",40.71694,-91.99028,"Tom Jantscher",adult,,Sighting,1,,,,,,,,,
46575,"Jim Durbin Drawer 077",2014-046953,SPM001005,"Syssphinx bisecta","Bisected Honey Locust Moth",Iowa,"Van Buren",2004-08-22,,"Shimek State Forest, Farmington Unit",40.64802,-91.7254,"Doug Veal",adult,,Pinned,1,,,,,,,,,
46576,"Frank Olsen Drawer 27",2014-046954,SPM002408,"Syssphinx bisecta","Bisected Honey Locust Moth",Iowa,"Van Buren",2003-08-02,,"Shimek State Forest, Farmington Unit",40.64802,-91.7254,"Frank Olsen",adult,,Pinned,1,,,,,,,,,"Located at Iowa State"
46577,"Frank Olsen Drawer 27",2014-046955,SPM002409,"Syssphinx bisecta","Bisected Honey Locust Moth",Iowa,"Van Buren",2003-08-02,,"Shimek State Forest, Farmington Unit",40.64802,-91.7254,"Frank Olsen",adult,,Pinned,1,,,,,,,,,"Located at Iowa State"
125893,,2015-016461,,"Actias luna","Luna Moth",Iowa,"Van Buren",2015-06-02,"2100 to 2300","Shimek State Forest, Farmington Unit",40.6659,-91.73637,"Jim Durbin",adult,Blacklight/Fluorescent,Photograph,1,66,73,57,4,210,30.02,clear,Full,
125898,,2015-016466,,"Actias luna","Luna Moth",Iowa,"Van Buren",2015-06-02,"2100 to 2300","Shimek State Forest, Farmington Unit",40.6659,-91.73637,"Jim Durbin",adult,Blacklight/Fluorescent,Photograph,1,66,73,57,4,210,30.02,clear,Full,
125916,,2015-016484,,"Actias luna","Luna Moth",Iowa,"Van Buren",2015-06-02,"2100 to 2300","Shimek State Forest, Farmington Unit",40.6659,-91.73637,"Jim Durbin",adult,Blacklight/Fluorescent,Photograph,1,66,73,57,4,210,30.02,clear,Full,
125917,,2015-016485,,"Actias luna","Luna Moth",Iowa,"Van Buren",2015-06-02,"2100 to 2300","Shimek State Forest, Farmington Unit",40.6659,-91.73637,"Jim Durbin",adult,Blacklight/Fluorescent,Photograph,1,66,73,57,4,210,30.02,clear,Full,
125939,,2015-016507,,"Actias luna","Luna Moth",Iowa,"Van Buren",2015-06-02,"2100 to 2300","Shimek State Forest, Farmington Unit",40.6659,-91.73637,"Jim Durbin",adult,Blacklight/Fluorescent,Photograph,1,66,73,57,4,210,30.02,clear,Full,
125940,,2015-016508,,"Actias luna","Luna Moth",Iowa,"Van Buren",2015-06-02,"2100 to 2300","Shimek State Forest, Farmington Unit",40.6659,-91.73637,"Jim Durbin",adult,Blacklight/Fluorescent,Photograph,1,66,73,57,4,210,30.02,clear,Full,
125941,,2015-016509,,"Actias luna","Luna Moth",Iowa,"Van Buren",2015-06-02,"2100 to 2300","Shimek State Forest, Farmington Unit",40.6659,-91.73637,"Jim Durbin",adult,Blacklight/Fluorescent,Photograph,1,66,73,57,4,210,30.02,clear,Full,
125942,,2015-016510,,"Actias luna","Luna Moth",Iowa,"Van Buren",2015-06-02,"2100 to 2300","Shimek State Forest, Farmington Unit",40.6659,-91.73637,"Jim Durbin",adult,Blacklight/Fluorescent,Photograph,1,66,73,57,4,210,30.02,clear,Full,
125943,,2015-016511,,"Actias luna","Luna Moth",Iowa,"Van Buren",2015-06-02,"2100 to 2300","Shimek State Forest, Farmington Unit",40.6659,-91.73637,"Jim Durbin",adult,Blacklight/Fluorescent,Photograph,1,66,73,57,4,210,30.02,clear,Full,
247616,"Frank Olsen Drawer 27",2020-000025,,"Syssphinx bicolor","Honey Locust Moth",Iowa,"Van Buren",2004-05-08,,"Shimek State Forest, Farmington Unit",40.64802,-91.7254,"Frank Olsen",adult,,Pinned,1,,,,,,,,,"Located at Iowa State"
277684,,,,"Antheraea polyphemus","Polyphemus Moth",Iowa,"Van Buren",2004-05-08,2100,"Shimek State Forest, Farmington Unit",40.650954,-91.716096,,,Blacklight,,1,,,,,,,,,"2100, mostly cloudy, 74, 0 wind"
277685,,,,"Antheraea polyphemus","Polyphemus Moth",Iowa,"Van Buren",2012-05-14,2145,"Shimek State Forest, Farmington Unit",40.665417,-91.735932,,,Blacklight,,2,,,,,,,,,"2145, clear, 75, 0-3 wind"
277686,,,,"Antheraea polyphemus","Polyphemus Moth",Iowa,"Van Buren",2011-07-20,2130,"Shimek State Forest, Farmington Unit",40.665417,-91.735932,,,Blacklight,,1,,,,,,,,,"2130, clear, 81, 0 wind"
277687,,,,"Antheraea polyphemus","Polyphemus Moth",Iowa,"Van Buren",2011-05-10,2200,"Shimek State Forest, Farmington Unit",40.665417,-91.735932,,,Blacklight,,1,,,,,,,,,"2200, partly cloudy, 75, 0-5 wind"
