ID,"Collection / Source","Catalog Number","Specify Number",Taxon,"Common Name",State,County,Date,Time,Locale,Latitude,Longitude,Collector,"Life Stage","Collection Method","Preparation Type",Count,Temperature,Humidity,"Dew Point",Wind,"Wind Direction","Barometric Pressure",Sky,"Moon Phase",Notes
16560,,2014-016858,SPM035708,"Argia apicalis","Blue-fronted Dancer",Iowa,"Van Buren",2013-08-07,,"Indian Lake Park, Farmington",40.63518,-91.75017,"Jim Durbin",adult,Blacklight/Fluorescent,Photograph,1,,,,,,,,,
16561,,2014-016859,SPM035711,"Argia apicalis","Blue-fronted Dancer",Iowa,"Van Buren",2013-08-07,,"Indian Lake Park, Farmington",40.63518,-91.75017,"Jim Durbin",adult,Blacklight/Fluorescent,Photograph,1,,,,,,,,,
16562,,2014-016860,SPM035718,"Argia apicalis","Blue-fronted Dancer",Iowa,"Van Buren",2013-08-07,,"Indian Lake Park, Farmington",40.63518,-91.75017,"Jim Durbin",adult,Blacklight/Fluorescent,Photograph,1,,,,,,,,,
149309,,2016-014054,,"Argia apicalis","Blue-fronted Dancer",Iowa,"Van Buren",1997-07-25,,"Van Buren County",40.700115,-91.909927,"Bob Cruden",adult,Sighting,Sighting,1,,,,,,,,,"Big Cedar Creek  -  30-60 ft wide"
149322,,2016-014067,,"Argia apicalis","Blue-fronted Dancer",Iowa,"Van Buren",1995-08-24,,"Van Buren County",40.700115,-91.909927,"Bob Cruden",adult,Sighting,Sighting,1,,,,,,,,,"Big Cedar Creek  -30-50 ft. wide - sandy"
149372,,2016-014117,,"Argia apicalis","Blue-fronted Dancer",Iowa,"Van Buren",1996-09-02,,"Van Buren County",40.700115,-91.909927,"Bob Cruden",adult,Sighting,Sighting,1,,,,,,,,,"Big Indian Creek  20-40 ft. wide"
149376,,2016-014121,,"Argia apicalis","Blue-fronted Dancer",Iowa,"Van Buren",1996-09-02,,"Big Indian Creek @ Hwy 2",40.674337,-91.961986,"Bob Cruden",adult,Sighting,Sighting,1,,,,,,,,,creek
149383,,2016-014128,,"Argia apicalis","Blue-fronted Dancer",Iowa,"Van Buren",1996-09-02,,"Van Buren County",40.700115,-91.909927,"Bob Cruden",adult,Sighting,Sighting,1,,,,,,,,,"Big Indian Creek  60-70 ft. wide"
152969,,2016-017714,,"Argia apicalis","Blue-fronted Dancer",Iowa,"Van Buren",1997-09-12,,"Van Buren County",40.700115,-91.909927,"Bob Cruden",adult,Sighting,Sighting,1,,,,,,,,,"Fox River  -  10-50 ft. wide  - good bottom"
155294,,2016-020039,,"Argia apicalis","Blue-fronted Dancer",Iowa,"Van Buren",1997-06-03,,"Lacey-Keosauqua State Park",40.711812,-91.970354,"Bob Cruden",adult,Sighting,Sighting,1,,,,,,,,,lake
156657,,2016-021402,,"Argia apicalis","Blue-fronted Dancer",Iowa,"Van Buren",1995-08-24,,"Van Buren County",40.700115,-91.909927,"Bob Cruden",adult,Sighting,Sighting,1,,,,,,,,,"Little Lick Creek"
163403,,2016-028148,,"Argia apicalis","Blue-fronted Dancer",Iowa,"Van Buren",1995-09-15,,"Van Buren County",40.700115,-91.909927,"Bob Cruden",adult,Sighting,Sighting,1,,,,,,,,,Stream
163442,,2016-028187,,"Argia apicalis","Blue-fronted Dancer",Iowa,"Van Buren",1997-07-25,,"Van Buren County",40.700115,-91.909927,"Bob Cruden",adult,Sighting,Sighting,1,,,,,,,,,"Stream  -  10-20 ft. wide"
272306,,,,"Argia apicalis","Blue-fronted Dancer",Iowa,"Van Buren",2020-09-24,11:36:17,"Lacey-Keosauqua State Park",40.7182658,-91.98814416,"Jim Durbin",adult,Blacklight/Fluorescent,Photograph,1,68,77,59,8,170,29.93,clear,"30% visible",
272308,,,,"Argia apicalis","Blue-fronted Dancer",Iowa,"Van Buren",2020-09-24,11:34:08,"Lacey-Keosauqua State Park",40.7182658,-91.98814416,"Jim Durbin",adult,Blacklight/Fluorescent,Photograph,1,68,77,59,8,170,29.93,clear,"30% visible",
345527,,,,"Argia apicalis","Blue-fronted Dancer",Iowa,"Van Buren",2023-06-24,,"Mount Sterling",40.616044,-91.933695,"Jay Gilliam",adult,Sighting,Photograph,15,,,,,,,,,3679
