ID,"Collection / Source","Catalog Number","Specify Number",Taxon,"Common Name",State,County,Date,Time,Locale,Latitude,Longitude,Collector,"Life Stage","Collection Method","Preparation Type",Count,Temperature,Humidity,"Dew Point",Wind,"Wind Direction","Barometric Pressure",Sky,"Moon Phase",Notes
17497,"Frank Olsen Drawer 37",2014-017797,SPM002596,"Baileya ophthalmica","Eyed Baileya",Iowa,"Van Buren",2004-05-08,,"Shimek State Forest, Farmington Unit",40.64802,-91.7254,"Frank Olsen",adult,,Pinned,1,,,,,,,,,"Located at Iowa State"
17498,"Frank Olsen Drawer 37",2014-017798,SPM002597,"Baileya ophthalmica","Eyed Baileya",Iowa,"Van Buren",2004-05-08,,"Shimek State Forest, Farmington Unit",40.64802,-91.7254,"Frank Olsen",adult,,Pinned,1,,,,,,,,,"Located at Iowa State"
17499,"Frank Olsen Drawer 37",2014-017799,SPM002598,"Baileya ophthalmica","Eyed Baileya",Iowa,"Van Buren",2004-05-08,,"Shimek State Forest, Farmington Unit",40.64802,-91.7254,"Frank Olsen",adult,,Pinned,1,,,,,,,,,"Located at Iowa State"
17501,"Jim Durbin Drawer 137",2014-017801,SPM004012,"Baileya ophthalmica","Eyed Baileya",Iowa,"Van Buren",2005-05-11,,"Shimek State Forest, Farmington Unit",40.6659,-91.73637,"Jim Durbin",adult,Blacklight/Fluorescent,Pinned,1,,,,,,,,,
17502,"Jim Durbin Drawer 137",2014-017802,SPM004013,"Baileya ophthalmica","Eyed Baileya",Iowa,"Van Buren",2005-05-11,,"Shimek State Forest, Farmington Unit",40.6659,-91.73637,"Jim Durbin",adult,Blacklight/Fluorescent,Pinned,1,,,,,,,,,
17503,"Jim Durbin Drawer 137",2014-017803,SPM004020,"Baileya ophthalmica","Eyed Baileya",Iowa,"Van Buren",2005-05-11,,"Shimek State Forest, Farmington Unit",40.6659,-91.73637,"Jim Durbin",adult,Blacklight/Fluorescent,Pinned,1,,,,,,,,,
17513,"Jim Durbin Drawer 137",2014-017813,SPM013745,"Baileya ophthalmica","Eyed Baileya",Iowa,"Van Buren",2009-05-09,,"Lacey-Keosauqua State Park",40.71688,-91.9908,"Jim Durbin",adult,Blacklight/Fluorescent,Pinned,1,,,,,,,,,
17514,"Jim Durbin Drawer 137",2014-017814,SPM013746,"Baileya ophthalmica","Eyed Baileya",Iowa,"Van Buren",2009-05-09,,"Lacey-Keosauqua State Park",40.71688,-91.9908,"Jim Durbin",adult,Blacklight/Fluorescent,Pinned,1,,,,,,,,,
17515,"Jim Durbin Drawer 137",2014-017815,SPM013747,"Baileya ophthalmica","Eyed Baileya",Iowa,"Van Buren",2009-05-09,,"Lacey-Keosauqua State Park",40.71688,-91.9908,"Jim Durbin",adult,Blacklight/Fluorescent,Pinned,1,,,,,,,,,
273105,"Frank Olsen Drawer 37",2020-000678,,"Baileya ophthalmica","Eyed Baileya",Iowa,"Van Buren",2004-05-08,,"Shimek State Forest, Farmington Unit",40.64802,-91.7254,"Frank Olsen",adult,,Pinned,1,,,,,,,,,"Located at Iowa State"
