ID,"Collection / Source","Catalog Number","Specify Number",Taxon,"Common Name",State,County,Date,Time,Locale,Latitude,Longitude,Collector,"Life Stage","Collection Method","Preparation Type",Count,Temperature,Humidity,"Dew Point",Wind,"Wind Direction","Barometric Pressure",Sky,"Moon Phase",Notes
131697,"Paul Martsching Collection",2015-022288,,"Hypsopygia costalis","Clover Hayworm Moth",Iowa,Story,2015-06-09,,"Ames, Paul",42.02064,-93.623952,"Paul Martsching",adult,"Building Light",Pinned,1,,,,,,,,,
131698,,2015-022289,,"Hypsopygia costalis","Clover Hayworm Moth",Iowa,Story,2015-06-17,,"Ames, Paul",42.02064,-93.623952,"Paul Martsching",adult,"Building Light",Sighting,1,,,,,,,,,
131699,,2015-022290,,"Hypsopygia costalis","Clover Hayworm Moth",Iowa,Story,2015-06-19,,"Ames, Paul",42.02064,-93.623952,"Paul Martsching",adult,"Building Light",Sighting,1,,,,,,,,,
131700,,2015-022291,,"Hypsopygia costalis","Clover Hayworm Moth",Iowa,Story,2015-08-13,,"Ames, Paul",42.02064,-93.623952,"Paul Martsching",adult,"Building Light",Sighting,1,,,,,,,,,
131701,,2015-022292,,"Hypsopygia costalis","Clover Hayworm Moth",Iowa,Story,2015-08-31,,"Ames, Paul",42.02064,-93.623952,"Paul Martsching",adult,"Building Light",Sighting,1,,,,,,,,,
131702,,2015-022293,,"Hypsopygia costalis","Clover Hayworm Moth",Iowa,Story,2015-09-02,,"Ames, Paul",42.02064,-93.623952,"Paul Martsching",adult,"Building Light",Sighting,1,,,,,,,,,
133622,"Paul Martsching Collection",2015-024216,,"Hypsopygia costalis","Clover Hayworm Moth",Iowa,Story,2003-10-10,,"Ames, Paul",42.02064,-93.623952,"Paul Martsching",adult,"Building Light",Pinned,1,,,,,,,,,
133623,"Paul Martsching Collection",2015-024217,,"Hypsopygia costalis","Clover Hayworm Moth",Iowa,Story,2007-09-06,,"Ames, Paul",42.02064,-93.623952,"Paul Martsching",adult,"Building Light",Pinned,1,,,,,,,,,
133624,"Paul Martsching Collection",2015-024218,,"Hypsopygia costalis","Clover Hayworm Moth",Iowa,Story,2003-10-06,,"Ames, Paul",42.02064,-93.623952,"Paul Martsching",adult,"Building Light",Pinned,1,,,,,,,,,
175601,"Paul Martsching Collection",2016-040351,,"Hypsopygia costalis","Clover Hayworm Moth",Iowa,Story,2016-08-14,,"Ames, Paul",42.02064,-93.623952,"Paul Martsching",adult,"Building Light",Pinned,1,,,,,,,,,
175603,"Paul Martsching Collection",2016-040353,,"Hypsopygia costalis","Clover Hayworm Moth",Iowa,Story,2016-08-15,,"Ames, Paul",42.02064,-93.623952,"Paul Martsching",adult,"Building Light",Pinned,1,,,,,,,,,
178102,,2016-042852,,"Hypsopygia costalis","Clover Hayworm Moth",Iowa,Story,2016-08-17,,"Ames, Paul",42.02064,-93.623952,"Paul Martsching",adult,"Building Light",Sighting,3,,,,,,,,,"17 Aug 2016 86/73 calm most of day. 18 Aug 1230-300 am CDST; 70/70; some fog; calm; full Moon.  Crickets!!"
178103,,2016-042853,,"Hypsopygia costalis","Clover Hayworm Moth",Iowa,Story,2016-08-23,,"Ames, Paul",42.02064,-93.623952,"Paul Martsching",adult,"Building Light",Sighting,2,,,,,,,,,"23 Aug 2016 81/70 S/SE 10 - 20 mph; mostly clear.  1245-200 am CDST 24 Aug 75/75 wind S 10 mph; overcast; North only; light rain by 200 am. "
178104,,2016-042854,,"Hypsopygia costalis","Clover Hayworm Moth",Iowa,Story,2016-08-24,,"Ames, Paul",42.02064,-93.623952,"Paul Martsching",adult,"Building Light",Sighting,1,,,,,,,,,"24 Aug 2016 81/73 W ~5 mph; overcast.  25 Aug 1245-300 am 65 deg; overcast; N ~6 mph."
178105,,2016-042855,,"Hypsopygia costalis","Clover Hayworm Moth",Iowa,Story,2016-08-27,,"Ames, Paul",42.02064,-93.623952,"Paul Martsching",adult,"Building Light",Sighting,1,,,,,,,,,"27 Aug 78/70calm > light & variable; fog early am; mostly cloudy; partly cloudy late pm. 1230-400 am CDST 28 Aug 62 deg; clear; calm > S ~ 5 mph; fog by 4 am; 60+ species!  Best night so far this year! ****"
178106,,2016-042856,,"Hypsopygia costalis","Clover Hayworm Moth",Iowa,Story,2016-09-04,,"Ames, Paul",42.02064,-93.623952,"Paul Martsching",adult,"Building Light",Sighting,1,,,,,,,,,"04 Sep 2016 79/65 S 10-15 mph; partly cloudy. 05 Sep 100-300 am 65 deg; S 10 mph; hazy/cirrus."
178107,,2016-042857,,"Hypsopygia costalis","Clover Hayworm Moth",Iowa,Story,2016-10-09,,"Ames, Paul",42.02064,-93.623952,"Paul Martsching",adult,"Building Light",Sighting,1,,,,,,,,,"09 Oct 2016 60/46 clear N ~7 mph.  100-130 & 230-300 am 10 Oct 50>48 deg; clear; SE 5 mph."
180141,"Paul Martsching Collection",2016-044891,,"Hypsopygia costalis","Clover Hayworm Moth",Iowa,Story,2016-10-09,,"Ames, Paul",42.02064,-93.623952,"Paul Martsching",adult,"Building Light",Pinned,1,,,,,,,,,
181602,,2016-046238,,"Hypsopygia costalis","Clover Hayworm Moth",Iowa,Story,2016-10-30,,"Ames, Paul",42.02064,-93.623952,"Paul Martsching",adult,"Building Light",Photograph,1,56,,,15,0,,"cirrus- partly cloudy",,
181635,,2016-046271,,"Hypsopygia costalis","Clover Hayworm Moth",Iowa,Story,2016-11-01,1000-1130,"Ames, Paul",42.02064,-93.623952,"Paul Martsching",adult,"Building Light",Sighting,1,57,,,7,45,,overcast,,
181653,,2016-046289,,"Hypsopygia costalis","Clover Hayworm Moth",Iowa,Story,2016-11-05,0145-0215,"Ames, Paul",42.02064,-93.623952,"Paul Martsching",adult,"Building Light",Sighting,1,46,,,0,0,,clear,,
181696,,2016-046332,,"Hypsopygia costalis","Clover Hayworm Moth",Iowa,Story,2016-11-17,,"Ames, Paul",42.02064,-93.623952,"Paul Martsching",adult,"Building Light",Sighting,1,50,,,0,0,,"mostly cloudy","waning gibbous",
183244,,2017-001205,,"Hypsopygia costalis","Clover Hayworm Moth",Iowa,Story,2003-09-06,,"Ames, Paul",42.02064,-93.623952,"Paul Martsching",adult,"Building Light",Sighting,2,,,,,,,,,
183245,,2017-001206,,"Hypsopygia costalis","Clover Hayworm Moth",Iowa,Story,2005-06-26,,"McFarland Park",42.092878,-93.571,"Paul Martsching",adult,"Building Light",Sighting,2,,,,,,,,,
183246,,2017-001207,,"Hypsopygia costalis","Clover Hayworm Moth",Iowa,Story,2006-06-23,,"Ames, Paul",42.02064,-93.623952,"Paul Martsching",adult,"Building Light",Sighting,1,,,,,,,,,
183247,,2017-001208,,"Hypsopygia costalis","Clover Hayworm Moth",Iowa,Story,2006-08-15,,"Ames, Paul",42.02064,-93.623952,"Paul Martsching",adult,"Building Light",Sighting,3,,,,,,,,,
183248,,2017-001209,,"Hypsopygia costalis","Clover Hayworm Moth",Iowa,Story,2006-09-15,,"Ames, Paul",42.02064,-93.623952,"Paul Martsching",adult,"Building Light",Sighting,2,,,,,,,,,
183249,,2017-001210,,"Hypsopygia costalis","Clover Hayworm Moth",Iowa,Story,2006-10-03,,"Ames, Paul",42.02064,-93.623952,"Paul Martsching",adult,"Building Light",Sighting,1,,,,,,,,,
183250,,2017-001211,,"Hypsopygia costalis","Clover Hayworm Moth",Iowa,Story,2007-06-16,,"Ames, Paul",42.02064,-93.623952,"Paul Martsching",adult,"Building Light",Sighting,2,,,,,,,,,
183251,,2017-001212,,"Hypsopygia costalis","Clover Hayworm Moth",Iowa,Story,2007-10-05,,"Ames, Paul",42.02064,-93.623952,"Paul Martsching",adult,"Building Light",Sighting,1,,,,,,,,,
183252,,2017-001213,,"Hypsopygia costalis","Clover Hayworm Moth",Iowa,Story,2009-09-10,,"Ames, Paul",42.02064,-93.623952,"Paul Martsching",adult,"Building Light",Sighting,2,,,,,,,,,
183253,,2017-001214,,"Hypsopygia costalis","Clover Hayworm Moth",Iowa,Story,2011-08-09,,"Ames, Paul",42.02064,-93.623952,"Paul Martsching",adult,"Building Light",Sighting,1,,,,,,,,,
183254,,2017-001215,,"Hypsopygia costalis","Clover Hayworm Moth",Iowa,Story,2012-07-02,,"Ames, Paul",42.02064,-93.623952,"Paul Martsching",adult,"Building Light",Sighting,1,,,,,,,,,
183255,,2017-001216,,"Hypsopygia costalis","Clover Hayworm Moth",Iowa,Story,2014-07-06,,"Ames, Paul",42.02064,-93.623952,"Paul Martsching",adult,"Building Light",Sighting,2,,,,,,,,,
183256,,2017-001217,,"Hypsopygia costalis","Clover Hayworm Moth",Iowa,Story,2014-08-27,,"Ames, Paul",42.02064,-93.623952,"Paul Martsching",adult,"Building Light",Sighting,2,,,,,,,,,
197296,,2017-015230,,"Hypsopygia costalis","Clover Hayworm Moth",Iowa,Story,2017-06-11,,"Ames, Paul",42.02064,-93.623952,"Paul Martsching",adult,"Building Light",Sighting,1,,,,,,,,,
197297,,2017-015231,,"Hypsopygia costalis","Clover Hayworm Moth",Iowa,Story,2017-06-16,,"Ames, Paul",42.02064,-93.623952,"Paul Martsching",adult,"Building Light",Sighting,1,,,,,,,,,
197298,,2017-015232,,"Hypsopygia costalis","Clover Hayworm Moth",Iowa,Story,2017-08-15,,"Ames, Paul",42.02064,-93.623952,"Paul Martsching",adult,"Building Light",Sighting,1,,,,,,,,,
197299,,2017-015233,,"Hypsopygia costalis","Clover Hayworm Moth",Iowa,Story,2017-08-24,,"Ames, Paul",42.02064,-93.623952,"Paul Martsching",adult,"Building Light",Sighting,2,,,,,,,,,
197300,,2017-015234,,"Hypsopygia costalis","Clover Hayworm Moth",Iowa,Story,2017-08-27,,"Ames, Paul",42.02064,-93.623952,"Paul Martsching",adult,"Building Light",Sighting,1,,,,,,,,,
197301,,2017-015235,,"Hypsopygia costalis","Clover Hayworm Moth",Iowa,Story,2017-08-28,,"Ames, Paul",42.02064,-93.623952,"Paul Martsching",adult,"Building Light",Sighting,2,,,,,,,,,
197302,,2017-015236,,"Hypsopygia costalis","Clover Hayworm Moth",Iowa,Story,2017-08-30,,"Ames, Paul",42.02064,-93.623952,"Paul Martsching",adult,"Building Light",Sighting,2,,,,,,,,,
197303,,2017-015237,,"Hypsopygia costalis","Clover Hayworm Moth",Iowa,Story,2017-08-31,,"Ames, Paul",42.02064,-93.623952,"Paul Martsching",adult,"Building Light",Sighting,1,,,,,,,,,
197304,,2017-015238,,"Hypsopygia costalis","Clover Hayworm Moth",Iowa,Story,2017-09-04,,"Ames, Paul",42.02064,-93.623952,"Paul Martsching",adult,"Building Light",Sighting,1,,,,,,,,,
226236,,2019-000956,,"Hypsopygia costalis","Clover Hayworm Moth",Iowa,Story,2018-06-01,,"Ames, Paul",42.02064,-93.623952,"Paul Martsching",adult,"Building Light",Sighting,1,,,,,,,,,
226237,,2019-000957,,"Hypsopygia costalis","Clover Hayworm Moth",Iowa,Story,2018-07-28,,"Ames, Paul",42.02064,-93.623952,"Paul Martsching",adult,"Building Light",Sighting,1,,,,,,,,,
226238,,2019-000958,,"Hypsopygia costalis","Clover Hayworm Moth",Iowa,Story,2018-08-17,,"Ames, Paul",42.02064,-93.623952,"Paul Martsching",adult,"Building Light",Sighting,1,,,,,,,,,
226239,,2019-000959,,"Hypsopygia costalis","Clover Hayworm Moth",Iowa,Story,2018-08-18,,"Ames, Paul",42.02064,-93.623952,"Paul Martsching",adult,"Building Light",Sighting,1,,,,,,,,,
226240,,2019-000960,,"Hypsopygia costalis","Clover Hayworm Moth",Iowa,Story,2018-08-25,,"Ames, Paul",42.02064,-93.623952,"Paul Martsching",adult,"Building Light",Sighting,1,,,,,,,,,
226241,,2019-000961,,"Hypsopygia costalis","Clover Hayworm Moth",Iowa,Story,2018-10-03,,"Ames, Paul",42.02064,-93.623952,"Paul Martsching",adult,"Building Light",Sighting,1,,,,,,,,,
242614,,,,"Hypsopygia costalis","Clover Hayworm Moth",Iowa,Story,2019-06-29,0330,"Ames, Paul",42.02064,-93.623952,"Paul Martsching",adult,"Building Light",Sighting,2,,,,,,,,,
242615,,,,"Hypsopygia costalis","Clover Hayworm Moth",Iowa,Story,2019-08-16,0330,"Ames, Paul",42.02064,-93.623952,"Paul Martsching",adult,"Building Light",Sighting,1,,,,,,,,,
242616,,,,"Hypsopygia costalis","Clover Hayworm Moth",Iowa,Story,2019-08-26,0330,"Ames, Paul",42.02064,-93.623952,"Paul Martsching",adult,"Building Light",Sighting,2,,,,,,,,,
242617,,,,"Hypsopygia costalis","Clover Hayworm Moth",Iowa,Story,2019-09-03,0330,"Ames, Paul",42.02064,-93.623952,"Paul Martsching",adult,"Building Light",Sighting,1,,,,,,,,,
242618,,,,"Hypsopygia costalis","Clover Hayworm Moth",Iowa,Story,2019-09-18,0330,"Ames, Paul",42.02064,-93.623952,"Paul Martsching",adult,"Building Light",Sighting,1,,,,,,,,,
272773,"Paul Martsching Collection",2020-000349,,"Hypsopygia costalis","Clover Hayworm Moth",Iowa,Story,2020-06-25,,"Ames, Paul",42.016779,-93.616948,"Paul Martsching",adult,"Building Light",Pinned,1,,,,,,,,,
278578,,,,"Hypsopygia costalis","Clover Hayworm Moth",Iowa,Story,2020-08-16,,"Ames, Paul",42.012366,-93.613528,"Paul Martsching",adult,Sighting,Sighting,1,,,,,,,,,
278579,,,,"Hypsopygia costalis","Clover Hayworm Moth",Iowa,Story,2020-08-26,,"Ames, Paul",42.012366,-93.613528,"Paul Martsching",adult,Sighting,Sighting,1,,,,,,,,,
291118,,,,"Hypsopygia costalis","Clover Hayworm Moth",Iowa,Story,2021-06-10,0530,"Ames, Paul",42.009923,-93.618306,"Paul Martsching",adult,Sighting,Sighting,1,68,,,0,0,,clear,,
