ID,"Collection / Source","Catalog Number","Specify Number",Taxon,"Common Name",State,County,Date,Time,Locale,Latitude,Longitude,Collector,"Life Stage","Collection Method","Preparation Type",Count,Temperature,Humidity,"Dew Point",Wind,"Wind Direction","Barometric Pressure",Sky,"Moon Phase",Notes
6260,,2014-006541,,"Vanessa atalanta","Red Admiral",Iowa,Sioux,1950-06-15,,"Sioux County",43.086994,-96.152695," USGS - NPWRC",adult,Sighting,Sighting,1,,,,,,,,,"HIstorical Record"
6334,,2014-006615,,"Vanessa cardui","Painted Lady",Iowa,Sioux,1950-09-10,,"Sioux County",43.086994,-96.152695," USGS - NPWRC",adult,Sighting,Sighting,1,,,,,,,,,"HIstorical Record"
109758,,2015-000314,,"Vanessa cardui","Painted Lady",Iowa,Sioux,2014-08-30,10:25-11:10AM,"Oak Grove State Park",43.064284,-96.458383,"Frank Olsen",adult,Sighting,Sighting,1,66,,,2,305,,"10% Clear",,"In bloom:  goldenrod, rough blazing star, many snakeroot, compass plant, evening primrose, partridge pea, thistles, 1 hoary vervain.  Overall, few nectar sources were available for butterflies.  Many grasshoppers were present.  "
184568,,2017-002530,,"Vanessa atalanta","Red Admiral",Iowa,Sioux,2008-08-03,,"Orange City",43.006565,-96.071001,"Jeremy Hummel",adult,Sighting,Pinned,1,,,,,,,,,"on purple coneflower inflorescence"
318112,,,,"Vanessa atalanta","Red Admiral",Iowa,Sioux,2022-07-01,,"Oak Grove State Park",43.061008,-96.470915,"Jay Gilliam",adult,Sighting,Photograph,1,,,,,,,,,
346726,,,,"Vanessa atalanta","Red Admiral",Iowa,Sioux,2023-07-02,,"Fairview Area",43.229133,-96.482404,"Jay Gilliam",adult,Sighting,Sighting,7,,,,,,,,,
346734,,,,"Vanessa atalanta","Red Admiral",Iowa,Sioux,2023-07-02,,"Oak Grove State Park",43.061008,-96.470915,"Jay Gilliam",adult,Sighting,Sighting,2,,,,,,,,,
346741,,,,"Vanessa atalanta","Red Admiral",Iowa,Sioux,2023-07-02,,"Sandy Hollow Recreation Area",43.065688,-96.115532,"Jay Gilliam",adult,Sighting,Sighting,1,,,,,,,,,
346747,,,,"Vanessa cardui","Painted Lady",Iowa,Sioux,2023-07-02,,"Bruce Schomaker Recreation Area",43.251747,-96.001739,"Jay Gilliam",adult,Sighting,Sighting,1,,,,,,,,,
