ID,"Collection / Source","Catalog Number","Specify Number",Taxon,"Common Name",State,County,Date,Time,Locale,Latitude,Longitude,Collector,"Life Stage","Collection Method","Preparation Type",Count,Temperature,Humidity,"Dew Point",Wind,"Wind Direction","Barometric Pressure",Sky,"Moon Phase",Notes
252,"Frank Olsen Drawer 48",2014-000252,SPM010590,"Crocidophora tuberculalis","Pale-winged Crocidiphora Moth",Iowa,Muscatine,2007-06-15,,"Wildcat Den State Park",41.4705,-90.88228,"Frank Olsen",adult,,Pinned,1,,,,,,,,,"Located at Iowa State"
509,,2014-000509,SPM013043,"Herpetogramma aeglealis","Serpentine Webworm Moth",Iowa,Muscatine,2008-08-31,,"Wildcat Den State Park",41.4705,-90.88228,"Frank Olsen",adult,,Pinned,1,,,,,,,,,"Located at Iowa State"
16199,,2014-016497,SPM019659,"Apogeshna stenialis","Checkered Apogeshna Moth",Iowa,Muscatine,2010-05-24,,"Nature Conservancy 231st St",41.42111,-91.24813,"Ryan Rasmussen",adult,,Photograph,1,,,,,,,,,
17779,"Frank Olsen Drawer 47",2014-018079,SPM020279,"Blepharomastix ranalis","Hollow-spotted Blepharomastix Moth",Iowa,Muscatine,2004-06-06,,"Wildcat Den State Park",41.4705,-90.88228,"Frank Olsen",adult,,Pinned,1,,,,,,,,,"Located at Iowa State"
17780,"Frank Olsen Drawer 47",2014-018080,SPM020280,"Blepharomastix ranalis","Hollow-spotted Blepharomastix Moth",Iowa,Muscatine,2005-06-26,,"Wildcat Den State Park",41.4705,-90.88228,"Frank Olsen",adult,,Pinned,1,,,,,,,,,"Located at Iowa State"
22352,"Jim Durbin Drawer 043",2014-022689,SPM015694,"Crambus agitatellus","Double Banded Grass Veneer Moth",Iowa,Muscatine,2009-08-04,,"Shady Creek Recreation Area",41.44813,-90.8732,"Jim Durbin",adult,Blacklight/Fluorescent,Pinned,1,,,,,,,,,
22535,"Jim Durbin Drawer 043",2014-022872,SPM015664,"Crambus agitatellus","Double Banded Grass Veneer Moth",Iowa,Muscatine,2009-08-04,,"Shady Creek Recreation Area",41.44813,-90.8732,"Jim Durbin",adult,Blacklight/Fluorescent,Pinned,1,,,,,,,,,
22536,"Jim Durbin Drawer 043",2014-022873,SPM015690,"Crambus agitatellus","Double Banded Grass Veneer Moth",Iowa,Muscatine,2009-08-04,,"Shady Creek Recreation Area",41.44813,-90.8732,"Jim Durbin",adult,Blacklight/Fluorescent,Pinned,1,,,,,,,,,
22537,"Jim Durbin Drawer 043",2014-022874,SPM015704,"Crambus agitatellus","Double Banded Grass Veneer Moth",Iowa,Muscatine,2009-08-04,,"Shady Creek Recreation Area",41.44813,-90.8732,"Jim Durbin",adult,Blacklight/Fluorescent,Pinned,1,,,,,,,,,
22546,"Jim Durbin Drawer 040",2014-022883,SPM015654,"Sitochroa palealis","Carrot Seed Moth",Iowa,Muscatine,2009-08-04,,"Shady Creek Recreation Area",41.44813,-90.8732,"Jim Durbin",adult,Blacklight/Fluorescent,Pinned,1,,,,,,,,,
23408,"Frank Olsen Drawer 17",2014-023754,SPM007773,"Desmia funeralis-maculalis",None,Iowa,Muscatine,2006-08-08,,"Wildcat Den State Park",41.4705,-90.88228,"Frank Olsen",adult,,Pinned,1,,,,,,,,,"Located at Iowa State"
23423,"Frank Olsen Drawer 17",2014-023769,SPM013051,"Desmia funeralis-maculalis",None,Iowa,Muscatine,2008-08-31,,"Wildcat Den State Park",41.4705,-90.88228,"Frank Olsen",adult,,Pinned,1,,,,,,,,,"Located at Iowa State"
24868,,2014-025215,SPM021126,"Elophila obliteralis","Waterlily Leafcutter Moth",Iowa,Muscatine,2010-05-20,,"Red Cedar Wildlife Area",41.45583,-91.24389,"Ryan Rasmussen",adult,,Photograph,1,,,,,,,,,
27763,,2014-028116,SPM019668,"Evergestis pallidata","Purple-backed Cabbageworm",Iowa,Muscatine,2010-05-19,,"Pike Run Wildlife Area",41.49795,-91.20764,"Ryan Rasmussen",adult,,Photograph,1,,,,,,,,,
28261,"Jim Durbin Drawer 037",2014-028614,SPM015745,"Glaphyria sesquistrialis","White-roped Glaphyria Moth",Iowa,Muscatine,2009-08-04,,"Wildcat Den State Park",41.4705,-90.88228,"Jim Durbin",adult,Blacklight/Fluorescent,Pinned,1,,,,,,,,,
29752,"Frank Olsen Drawer 17",2014-030112,SPM002972,"Herpetogramma bipunctalis","Southern Beet Webworm Moth",Iowa,Muscatine,2004-06-06,,"Wildcat Den State Park",41.4705,-90.88228,"Frank Olsen",adult,,Pinned,1,,,,,,,,,"Located at Iowa State"
29753,"Frank Olsen Drawer 17",2014-030113,SPM005566,"Herpetogramma bipunctalis","Southern Beet Webworm Moth",Iowa,Muscatine,2005-06-26,,"Wildcat Den State Park",41.4705,-90.88228,"Frank Olsen",adult,,Pinned,1,,,,,,,,,"Located at Iowa State"
29816,,2014-030176,SPM005780,"Herpetogramma aeglealis","Serpentine Webworm Moth",Iowa,Muscatine,2005-06-26,,"Wildcat Den State Park",41.4705,-90.88228,"Frank Olsen",adult,,Pinned,1,,,,,,,,,"Located at Iowa State"
29817,"Frank Olsen Drawer 17",2014-030177,SPM005781,"Herpetogramma thestealis","Zigzag Herpetogramma Moth",Iowa,Muscatine,2005-06-26,,"Wildcat Den State Park",41.4705,-90.88228,"Frank Olsen",adult,,Pinned,1,,,,,,,,,"Located at Iowa State"
29818,"Frank Olsen Drawer 17",2014-030178,SPM005782,"Herpetogramma thestealis","Zigzag Herpetogramma Moth",Iowa,Muscatine,2005-06-26,,"Wildcat Den State Park",41.4705,-90.88228,"Frank Olsen",adult,,Pinned,1,,,,,,,,,"Located at Iowa State"
30956,,2014-031328,SPM033566,"Hymenia perspectalis","Spotted Beet Webworm Moth",Iowa,Muscatine,2010-09-22,,"Swamp White Oak Preserve",41.41577,-91.31714,"Ryan Rasmussen",adult,,Photograph,1,,,,,,,,,
34844,"Frank Olsen Drawer 47",2014-035217,SPM013343,"Lygropia rivulalis","Bog Lygropia",Iowa,Muscatine,2008-08-31,,"Wildcat Den State Park",41.4705,-90.88228,"Frank Olsen",adult,,Pinned,1,,,,,,,,,"Located at Iowa State"
37999,,2014-038373,SPM017428,"Nomophila nearctica","Lucerne Moth",Iowa,Muscatine,2010-04-20,,"Nature Conservancy 231st St",41.4149,-91.2521,"Ryan Rasmussen",adult,,Photograph,1,,,,,,,,,
38014,,2014-038388,SPM021148,"Nomophila nearctica","Lucerne Moth",Iowa,Muscatine,2010-07-21,,"Red Cedar Wildlife Area",41.45583,-91.24389,"Ryan Rasmussen",adult,,Photograph,1,,,,,,,,,
38026,"Jim Durbin Drawer 041",2014-038400,SPM026278,"Nomophila nearctica","Lucerne Moth",Iowa,Muscatine,2012-04-24,,"Red Cedar Wildlife Area",41.45583,-91.24389,"Jim Durbin",adult,Net,Pinned,1,,,,,,,,,
39187,,2014-039561,SPM007886,"Ostrinia nubilalis","European Corn Borer Moth",Iowa,Muscatine,2006-05-23,,"Wildcat Den State Park",41.4705,-90.88228,"Frank Olsen",adult,,Photograph,1,,,,,,,,,
39188,,2014-039562,SPM007887,"Ostrinia penitalis","American Lotus Borer Moth",Iowa,Muscatine,2006-08-08,,"Wildcat Den State Park",41.4705,-90.88228,"Frank Olsen",adult,,Photograph,1,,,,,,,,,
39307,"Jim Durbin Drawer 037",2014-039681,SPM015641,"Ostrinia obumbratalis","Smartweed Borer Moth",Iowa,Muscatine,2009-08-04,,"Shady Creek Recreation Area",41.44813,-90.8732,"Jim Durbin",adult,Blacklight/Fluorescent,Pinned,1,,,,,,,,,
39513,"Jim Durbin Drawer 041",2014-039887,SPM015636,"Palpita arsaltealis",None,Iowa,Muscatine,2009-08-04,,"Shady Creek Recreation Area",41.44813,-90.8732,"Jim Durbin",adult,Blacklight/Fluorescent,Pinned,1,,,,,,,,,
39559,"Jim Durbin Drawer 041",2014-039933,SPM015644,"Palpita magniferalis","Splendid Palpita",Iowa,Muscatine,2009-08-04,,"Shady Creek Recreation Area",41.44813,-90.8732,"Jim Durbin",adult,Blacklight/Fluorescent,Pinned,1,,,,,,,,,
39560,"Frank Olsen Drawer 17",2014-039934,SPM016014,"Palpita magniferalis","Splendid Palpita",Iowa,Muscatine,2006-05-23,,"Wildcat Den State Park",41.4705,-90.88228,"Frank Olsen",adult,,Pinned,1,,,,,,,,,"Located at Iowa State"
41661,"Jim Durbin Drawer 037",2014-042038,SPM015683,"Anania tertialis","Crowned Phlyctaenia Moth",Iowa,Muscatine,2009-08-04,,"Shady Creek Recreation Area",41.44813,-90.8732,"Jim Durbin",adult,Blacklight/Fluorescent,Pinned,1,,,,,,,,,
43027,,2014-043404,SPM019506,"Polygrammodes flavidalis","Ironweed Root Moth",Iowa,Muscatine,2010-07-08,,"Red Cedar Wildlife Area",41.45583,-91.24389,"Ryan Rasmussen",adult,,Photograph,1,,,,,,,,,
43028,,2014-043405,SPM019666,"Polygrammodes flavidalis","Ironweed Root Moth",Iowa,Muscatine,2010-07-08,,"Kautz Fen",41.4685,-91.053,"Ryan Rasmussen",adult,,Photograph,1,,,,,,,,,
44398,,2014-044775,SPM019670,"Pyrausta bicoloralis","Bicolored Pyrausta Moth",Iowa,Muscatine,2010-07-06,,"Griner Preserve",41.5176,-91.07542,"Ryan Rasmussen",adult,,Photograph,1,,,,,,,,,
44425,"Jim Durbin Drawer 040",2014-044802,SPM015676,"Pyrausta generosa",None,Iowa,Muscatine,2009-08-04,,"Shady Creek Recreation Area",41.44813,-90.8732,"Jim Durbin",adult,Blacklight/Fluorescent,Pinned,1,,,,,,,,,
44451,,2014-044828,SPM033561,"Pyrausta laticlavia","Southern Purple Mint Moth",Iowa,Muscatine,2010-09-03,,"Red Cedar Wildlife Area",41.46204,-91.26145,"Ryan Rasmussen",adult,,Photograph,1,,,,,,,,,
44515,,2014-044892,SPM033562,"Pyrausta signatalis","Raspberry Pyrausta Moth",Iowa,Muscatine,2010-07-13,,"Red Cedar Wildlife Area",41.46204,-91.26145,"Ryan Rasmussen",adult,,Photograph,1,,,,,,,,,
48262,,2014-048640,SPM021101,"Udea rubigalis","Celery Leaftier Moth",Iowa,Muscatine,2010-07-21,,"Red Cedar Wildlife Area",41.45583,-91.24389,"Ryan G",adult,,Photograph,1,,,,,,,,,
48285,"Jim Durbin Drawer 040",2014-048663,SPM026280,"Udea rubigalis","Celery Leaftier Moth",Iowa,Muscatine,2012-04-24,,"Red Cedar Wildlife Area",41.45583,-91.24389,"Jim Durbin",adult,Net,Pinned,1,,,,,,,,,
48466,"Frank Olsen Drawer 47",2014-048844,SPM013059,"Urola nivalis","Snowy Urola",Iowa,Muscatine,2008-08-31,,"Wildcat Den State Park",41.4705,-90.88228,"Frank Olsen",adult,,Pinned,1,,,,,,,,,"Located at Iowa State"
48475,,2014-048853,SPM016892,"Urola nivalis","Snowy Urola",Iowa,Muscatine,2009-06-13,,"McKeown Bridge River Access",41.41028,-91.29139,"Moni Hayne",adult,Blacklight/Fluorescent,Photograph,1,,,,,,,,,
67073,"Frank Olsen Drawer 17",2014-067678,,"Desmia funeralis-maculalis",None,Iowa,Muscatine,2014-06-06,,"Cedar Bluffs Recreation Area",41.346074,-91.315521,"Frank Olsen",adult,,Pinned,1,,,,,,,,,"Located at Iowa State"
69026,,2014-069633,,"Urola nivalis","Snowy Urola",Iowa,Muscatine,2009-06-13,,"McKeown Bridge River Access",41.41028,-91.29139,"Moni Hayne",adult,Blacklight/Fluorescent,Sighting,1,,,,,,,,,
120853,,2015-011240,,"Apogeshna stenialis","Checkered Apogeshna Moth",Iowa,Muscatine,2010-07-10,,"Wildcat Den State Park",41.4705,-90.88228,"Frank Olsen",adult,,Pinned,1,,,,,,,,,"Located at Iowa State"
135401,,2015-025995,,"Microcrambus biguttellus","Gold-stripe Grass-veneer Moth",Iowa,Muscatine,2008-08-31,,"Wildcat Den State Park",41.4705,-90.88228,"Frank Olsen",adult,,Pinned,1,,,,,,,,,"Located at Iowa State"
227847,,2019-002569,,"Nomophila nearctica","Lucerne Moth",Iowa,Muscatine,2009-08-04,,"Junction of Pettibone Ave and Wiggins Rd",41.351391,-91.071869,"Jim Durbin",adult,Blacklight/Fluorescent,Photograph,1,,,,,,,,,
302434,"Jim Durbin Drawer 042",2021-000624,,"Herpetogramma thestealis","Zigzag Herpetogramma Moth",Iowa,Muscatine,2008-08-31,,"Wildcat Den State Park",41.469488,-90.883733,"Frank Olsen",adult,Blacklight/Florescent,Pinned,1,,,,,,,,,
308982,"Jim Durbin Drawer 040",2022-000251,,"Sericoplaga externalis",None,Iowa,Muscatine,2006-05-23,,"Wildcat Den State Park",41.469841,-90.884833,"Frank Olsen",adult,Blacklighting,Pinned,1,,,,,,,,,
335418,,,,"Scoparia biplagialis","Double-striped Scoparia Moth",Iowa,Muscatine,2023-06-21,21:49:19,"Big Sand Mound Prairie Preserve, Muscatine County",41.342624268333,-91.086409253333,"Jim Durbin",adult,Blacklight/Fluorescent,Photograph,1,80,56,63,0,90,30.01,clear,"10% visible",
335426,,,,"Crambus agitatellus","Double Banded Grass Veneer Moth",Iowa,Muscatine,2023-06-21,21:56:53,"Big Sand Mound Prairie Preserve, Muscatine County",41.342624268333,-91.086409253333,"Jim Durbin",adult,Blacklight/Fluorescent,Photograph,1,80,56,63,0,90,30.01,clear,"10% visible",
335478,,,,"Udea rubigalis","Celery Leaftier Moth",Iowa,Muscatine,2023-06-21,22:24:31,"Big Sand Mound Prairie Preserve, Muscatine County",41.342624268333,-91.086409253333,"Jim Durbin",adult,Blacklight/Fluorescent,Photograph,1,80,56,63,0,90,30.01,clear,"10% visible",
335480,,,,"Crambus saltuellus","Pasture Grass-veneer Moth",Iowa,Muscatine,2023-06-21,22:25:04,"Big Sand Mound Prairie Preserve, Muscatine County",41.342624268333,-91.086409253333,"Jim Durbin",adult,Blacklight/Fluorescent,Photograph,1,80,56,63,0,90,30.01,clear,"10% visible",
335491,,,,"Pediasia trisecta","Sod Webworm Moth",Iowa,Muscatine,2023-06-21,22:39:38,"Big Sand Mound Prairie Preserve, Muscatine County",41.342624268333,-91.086409253333,"Jim Durbin",adult,Blacklight/Fluorescent,Photograph,1,80,56,63,0,90,30.01,clear,"10% visible",
335498,,,,"Crambus saltuellus","Pasture Grass-veneer Moth",Iowa,Muscatine,2023-06-21,22:40:55,"Big Sand Mound Prairie Preserve, Muscatine County",41.342624268333,-91.086409253333,"Jim Durbin",adult,Blacklight/Fluorescent,Photograph,1,80,56,63,0,90,30.01,clear,"10% visible",
335501,,,,"Crambus saltuellus","Pasture Grass-veneer Moth",Iowa,Muscatine,2023-06-21,22:42:30,"Big Sand Mound Prairie Preserve, Muscatine County",41.342624268333,-91.086409253333,"Jim Durbin",adult,Blacklight/Fluorescent,Photograph,1,80,56,63,0,90,30.01,clear,"10% visible",
335502,,,,"Nomophila nearctica","Lucerne Moth",Iowa,Muscatine,2023-06-21,22:42:39,"Big Sand Mound Prairie Preserve, Muscatine County",41.342624268333,-91.086409253333,"Jim Durbin",adult,Blacklight/Fluorescent,Photograph,1,80,56,63,0,90,30.01,clear,"10% visible",
335512,,,,"Crambus agitatellus","Double Banded Grass Veneer Moth",Iowa,Muscatine,2023-06-21,22:46:13,"Big Sand Mound Prairie Preserve, Muscatine County",41.342624268333,-91.086409253333,"Jim Durbin",adult,Blacklight/Fluorescent,Photograph,1,80,56,63,0,90,30.01,clear,"10% visible",
335525,,,,"Nomophila nearctica","Lucerne Moth",Iowa,Muscatine,2023-06-21,22:50:43,"Big Sand Mound Prairie Preserve, Muscatine County",41.342624268333,-91.086409253333,"Jim Durbin",adult,Blacklight/Fluorescent,Photograph,1,80,56,63,0,90,30.01,clear,"10% visible",
335528,,,,"Udea rubigalis","Celery Leaftier Moth",Iowa,Muscatine,2023-06-21,22:55:23,"Big Sand Mound Prairie Preserve, Muscatine County",41.342624268333,-91.086409253333,"Jim Durbin",adult,Blacklight/Fluorescent,Photograph,1,80,56,63,0,90,30.01,clear,"10% visible",
335530,,,,"Crambus agitatellus","Double Banded Grass Veneer Moth",Iowa,Muscatine,2023-06-21,22:56:11,"Big Sand Mound Prairie Preserve, Muscatine County",41.342624268333,-91.086409253333,"Jim Durbin",adult,Blacklight/Fluorescent,Photograph,1,80,56,63,0,90,30.01,clear,"10% visible",
335533,,,,"Nomophila nearctica","Lucerne Moth",Iowa,Muscatine,2023-06-21,22:56:28,"Big Sand Mound Prairie Preserve, Muscatine County",41.342624268333,-91.086409253333,"Jim Durbin",adult,Blacklight/Fluorescent,Photograph,1,80,56,63,0,90,30.01,clear,"10% visible",
335536,,,,"Crambus agitatellus","Double Banded Grass Veneer Moth",Iowa,Muscatine,2023-06-21,22:57:04,"Big Sand Mound Prairie Preserve, Muscatine County",41.342624268333,-91.086409253333,"Jim Durbin",adult,Blacklight/Fluorescent,Photograph,1,80,56,63,0,90,30.01,clear,"10% visible",
338045,,,,"Scoparia biplagialis","Double-striped Scoparia Moth",Iowa,Muscatine,2023-07-18,21:12:31,"Big Sand Mound Prairie Preserve, Muscatine County",41.34026787,-91.08103262,"Jim Durbin",adult,Blacklight/Fluorescent,Photograph,1,72,70,62,0,90,29.99,"partly cloudy","new moon",
338053,,,,"Scoparia biplagialis","Double-striped Scoparia Moth",Iowa,Muscatine,2023-07-18,21:27:12,"Big Sand Mound Prairie Preserve, Muscatine County",41.34026787,-91.08103262,"Jim Durbin",adult,Blacklight/Fluorescent,Photograph,1,72,70,62,0,90,29.99,"partly cloudy","new moon",
338058,,,,"Ostrinia penitalis","American Lotus Borer Moth",Iowa,Muscatine,2023-07-18,21:29:07,"Big Sand Mound Prairie Preserve, Muscatine County",41.34026787,-91.08103262,"Jim Durbin",adult,Blacklight/Fluorescent,Photograph,1,72,70,62,0,90,29.99,"partly cloudy","new moon",
338069,,,,"Ostrinia penitalis","American Lotus Borer Moth",Iowa,Muscatine,2023-07-18,21:43:49,"Big Sand Mound Prairie Preserve, Muscatine County",41.34026787,-91.08103262,"Jim Durbin",adult,Blacklight/Fluorescent,Photograph,1,72,70,62,0,90,29.99,"partly cloudy","new moon",
338071,,,,"Scoparia biplagialis","Double-striped Scoparia Moth",Iowa,Muscatine,2023-07-18,21:44:58,"Big Sand Mound Prairie Preserve, Muscatine County",41.34026787,-91.08103262,"Jim Durbin",adult,Blacklight/Fluorescent,Photograph,1,72,70,62,0,90,29.99,"partly cloudy","new moon",
338072,,,,"Ostrinia penitalis","American Lotus Borer Moth",Iowa,Muscatine,2023-07-18,21:45:30,"Big Sand Mound Prairie Preserve, Muscatine County",41.34026787,-91.08103262,"Jim Durbin",adult,Blacklight/Fluorescent,Photograph,1,72,70,62,0,90,29.99,"partly cloudy","new moon",
338073,,,,"Scoparia biplagialis","Double-striped Scoparia Moth",Iowa,Muscatine,2023-07-18,21:46:08,"Big Sand Mound Prairie Preserve, Muscatine County",41.34026787,-91.08103262,"Jim Durbin",adult,Blacklight/Fluorescent,Photograph,1,72,70,62,0,90,29.99,"partly cloudy","new moon",
338082,,,,"Stegea eripalis",None,Iowa,Muscatine,2023-07-18,21:51:10,"Big Sand Mound Prairie Preserve, Muscatine County",41.34026787,-91.08103262,"Jim Durbin",adult,Blacklight/Fluorescent,Photograph,1,72,70,62,0,90,29.99,"partly cloudy","new moon",
338084,,,,"Chrysoteuchia topiarius","Topiary Grass-veneer",Iowa,Muscatine,2023-07-18,21:52:17,"Big Sand Mound Prairie Preserve, Muscatine County",41.34026787,-91.08103262,"Jim Durbin",adult,Blacklight/Fluorescent,Photograph,1,72,70,62,0,90,29.99,"partly cloudy","new moon",
338090,,,,"Chrysoteuchia topiarius","Topiary Grass-veneer",Iowa,Muscatine,2023-07-18,22:02:21,"Big Sand Mound Prairie Preserve, Muscatine County",41.34026787,-91.08103262,"Jim Durbin",adult,Blacklight/Fluorescent,Photograph,1,72,70,62,0,90,29.99,"partly cloudy","new moon",
338100,,,,"Stegea eripalis",None,Iowa,Muscatine,2023-07-18,22:23:41,"Big Sand Mound Prairie Preserve, Muscatine County",41.34026787,-91.08103262,"Jim Durbin",adult,Blacklight/Fluorescent,Photograph,1,72,70,62,0,90,29.99,"partly cloudy","new moon",
338101,,,,"Saucrobotys futilalis","Dogbane Saucrobotys Moth",Iowa,Muscatine,2023-07-18,22:25:58,"Big Sand Mound Prairie Preserve, Muscatine County",41.34026787,-91.08103262,"Jim Durbin",adult,Blacklight/Fluorescent,Photograph,1,72,70,62,0,90,29.99,"partly cloudy","new moon",
338108,,,,"Microcrambus elegans","Elegant Grass Veneer Moth",Iowa,Muscatine,2023-07-18,22:29:32,"Big Sand Mound Prairie Preserve, Muscatine County",41.34026787,-91.08103262,"Jim Durbin",adult,Blacklight/Fluorescent,Photograph,1,72,70,62,0,90,29.99,"partly cloudy","new moon",
338109,,,,"Pediasia trisecta","Sod Webworm Moth",Iowa,Muscatine,2023-07-18,22:30:01,"Big Sand Mound Prairie Preserve, Muscatine County",41.34026787,-91.08103262,"Jim Durbin",adult,Blacklight/Fluorescent,Photograph,1,72,70,62,0,90,29.99,"partly cloudy","new moon",
338110,,,,"Chrysoteuchia topiarius","Topiary Grass-veneer",Iowa,Muscatine,2023-07-18,22:30:35,"Big Sand Mound Prairie Preserve, Muscatine County",41.34026787,-91.08103262,"Jim Durbin",adult,Blacklight/Fluorescent,Photograph,1,72,70,62,0,90,29.99,"partly cloudy","new moon",
338113,,,,"Crambus agitatellus","Double Banded Grass Veneer Moth",Iowa,Muscatine,2023-07-18,22:31:24,"Big Sand Mound Prairie Preserve, Muscatine County",41.34026787,-91.08103262,"Jim Durbin",adult,Blacklight/Fluorescent,Photograph,1,72,70,62,0,90,29.99,"partly cloudy","new moon",
338118,,,,"Stegea eripalis",None,Iowa,Muscatine,2023-07-18,22:38:58,"Big Sand Mound Prairie Preserve, Muscatine County",41.34026787,-91.08103262,"Jim Durbin",adult,Blacklight/Fluorescent,Photograph,1,72,70,62,0,90,29.99,"partly cloudy","new moon",
338119,,,,"Microcrambus elegans","Elegant Grass Veneer Moth",Iowa,Muscatine,2023-07-18,22:40:40,"Big Sand Mound Prairie Preserve, Muscatine County",41.34026787,-91.08103262,"Jim Durbin",adult,Blacklight/Fluorescent,Photograph,1,72,70,62,0,90,29.99,"partly cloudy","new moon",
338128,,,,"Stegea eripalis",None,Iowa,Muscatine,2023-07-18,22:48:18,"Big Sand Mound Prairie Preserve, Muscatine County",41.34026787,-91.08103262,"Jim Durbin",adult,Blacklight/Fluorescent,Photograph,1,72,70,62,0,90,29.99,"partly cloudy","new moon",
338129,,,,"Loxostegopsis merrickalis","Merrick's Pyralid Moth",Iowa,Muscatine,2023-07-18,22:48:26,"Big Sand Mound Prairie Preserve, Muscatine County",41.34026787,-91.08103262,"Jim Durbin",adult,Blacklight/Fluorescent,Photograph,1,72,70,62,0,90,29.99,"partly cloudy","new moon",
338130,,,,"Glaphyria glaphyralis","Common Glaphyria Moth",Iowa,Muscatine,2023-07-18,22:48:52,"Big Sand Mound Prairie Preserve, Muscatine County",41.34026787,-91.08103262,"Jim Durbin",adult,Blacklight/Fluorescent,Photograph,1,72,70,62,0,90,29.99,"partly cloudy","new moon",
338132,,,,"Stegea eripalis",None,Iowa,Muscatine,2023-07-18,22:49:11,"Big Sand Mound Prairie Preserve, Muscatine County",41.34026787,-91.08103262,"Jim Durbin",adult,Blacklight/Fluorescent,Photograph,1,72,70,62,0,90,29.99,"partly cloudy","new moon",
338136,,,,"Eustixia pupula","Spotted Peppergrass Moth",Iowa,Muscatine,2023-07-18,22:51:38,"Big Sand Mound Prairie Preserve, Muscatine County",41.34026787,-91.08103262,"Jim Durbin",adult,Blacklight/Fluorescent,Photograph,1,72,70,62,0,90,29.99,"partly cloudy","new moon",
338137,,,,"Eudonia strigalis","Striped Eudonia Moth",Iowa,Muscatine,2023-07-18,22:51:50,"Big Sand Mound Prairie Preserve, Muscatine County",41.34026787,-91.08103262,"Jim Durbin",adult,Blacklight/Fluorescent,Photograph,1,72,70,62,0,90,29.99,"partly cloudy","new moon",
338138,,,,"Eudonia strigalis","Striped Eudonia Moth",Iowa,Muscatine,2023-07-18,22:51:51,"Big Sand Mound Prairie Preserve, Muscatine County",41.34026787,-91.08103262,"Jim Durbin",adult,Blacklight/Fluorescent,Photograph,1,72,70,62,0,90,29.99,"partly cloudy","new moon",
338142,,,,"Crambus agitatellus","Double Banded Grass Veneer Moth",Iowa,Muscatine,2023-07-18,22:53:25,"Big Sand Mound Prairie Preserve, Muscatine County",41.34026787,-91.08103262,"Jim Durbin",adult,Blacklight/Fluorescent,Photograph,1,72,70,62,0,90,29.99,"partly cloudy","new moon",
338145,,,,"Glaphyria sesquistrialis","White-roped Glaphyria Moth",Iowa,Muscatine,2023-07-18,23:05:11,"Big Sand Mound Prairie Preserve, Muscatine County",41.34026787,-91.08103262,"Jim Durbin",adult,Blacklight/Fluorescent,Photograph,1,72,70,62,0,90,29.99,"partly cloudy","new moon",
338147,,,,"Ostrinia penitalis","American Lotus Borer Moth",Iowa,Muscatine,2023-07-18,23:05:57,"Big Sand Mound Prairie Preserve, Muscatine County",41.34026787,-91.08103262,"Jim Durbin",adult,Blacklight/Fluorescent,Photograph,1,72,70,62,0,90,29.99,"partly cloudy","new moon",
338148,,,,"Aethiophysa invisalis",None,Iowa,Muscatine,2023-07-18,23:06:22,"Big Sand Mound Prairie Preserve, Muscatine County",41.34026787,-91.08103262,"Jim Durbin",adult,Blacklight/Fluorescent,Photograph,1,72,70,62,0,90,29.99,"partly cloudy","new moon",
338150,,,,"Udea rubigalis","Celery Leaftier Moth",Iowa,Muscatine,2023-07-18,23:07:26,"Big Sand Mound Prairie Preserve, Muscatine County",41.34026787,-91.08103262,"Jim Durbin",adult,Blacklight/Fluorescent,Photograph,1,72,70,62,0,90,29.99,"partly cloudy","new moon",
338153,,,,"Pyrausta signatalis","Raspberry Pyrausta Moth",Iowa,Muscatine,2023-07-18,23:08:05,"Big Sand Mound Prairie Preserve, Muscatine County",41.34026787,-91.08103262,"Jim Durbin",adult,Blacklight/Fluorescent,Photograph,1,72,70,62,0,90,29.99,"partly cloudy","new moon",
338155,,,,"Chrysoteuchia topiarius","Topiary Grass-veneer",Iowa,Muscatine,2023-07-18,23:09:28,"Big Sand Mound Prairie Preserve, Muscatine County",41.34026787,-91.08103262,"Jim Durbin",adult,Blacklight/Fluorescent,Photograph,1,72,70,62,0,90,29.99,"partly cloudy","new moon",
339712,,,,"Udea rubigalis","Celery Leaftier Moth",Iowa,Muscatine,2023-08-17,20:43:01,"Big Sand Mound Prairie Preserve, Muscatine County",41.34031372,-91.0810559,"Jim Durbin",adult,Blacklight/Fluorescent,Photograph,1,69,66,57,0,0,29.93,clear,"new moon",
339719,,,,"Saucrobotys futilalis","Dogbane Saucrobotys Moth",Iowa,Muscatine,2023-08-17,20:45:50,"Big Sand Mound Prairie Preserve, Muscatine County",41.34031372,-91.0810559,"Jim Durbin",adult,Blacklight/Fluorescent,Photograph,1,69,66,57,0,0,29.93,clear,"new moon",