ID,"Collection / Source","Catalog Number","Specify Number",Taxon,"Common Name",State,County,Date,Time,Locale,Latitude,Longitude,Collector,"Life Stage","Collection Method","Preparation Type",Count,Temperature,Humidity,"Dew Point",Wind,"Wind Direction","Barometric Pressure",Sky,"Moon Phase",Notes
2977,,2014-003258,,"Erynnis brizo","Sleepy Duskywing",Iowa,Mills,1950-04-30,,Redacted,Redacted,Redacted," USGS - NPWRC",adult,Sighting,Sighting,1,,,,,,,,,"HIstorical Record"
3000,,2014-003281,,"Erynnis horatius","Horace's Duskywing",Iowa,Mills,1950-07-01,,"Mills County",41.06245,-95.645798," USGS - NPWRC",adult,Sighting,Sighting,1,,,,,,,,,"HIstorical Record"
6792,,2014-007073,,"Erynnis baptisiae","Wild Indigo Duskywing",Iowa,Mills,2011-05-08,,"Folsom Point Preserve",41.153044,-95.796881,"Aaron Brees",adult,Sighting,Photograph,1,,,,,,,,,
6800,,2014-007081,,"Erynnis baptisiae","Wild Indigo Duskywing",Iowa,Mills,2011-07-24,,"Folsom Point Preserve",41.153044,-95.796881,"Aaron Brees",adult,Sighting,Sighting,4,,,,,,,,,
6801,,2014-007082,,"Erynnis baptisiae","Wild Indigo Duskywing",Iowa,Mills,2010-09-04,,"Folsom Point Preserve",41.153044,-95.796881,"Aaron Brees",adult,Sighting,Sighting,2,,,,,,,,,
107043,,2014-107790,,"Erynnis lucilius","Columbine Duskywing",Iowa,Mills,1989-09-02,,Redacted,Redacted,Redacted,"Tim Orwig",adult,Sighting,Sighting,1,,,,,,,,,
130970,,2015-021561,,"Erynnis baptisiae","Wild Indigo Duskywing",Iowa,Mills,2015-09-01,,"Folsom Point Preserve",41.16139,-95.795,"Frank Olsen",adult,Sighting,Sighting,8,80,,,9,135,,"partly sunny",,
138220,,2016-002765,,"Erynnis funeralis","Funeral Duskywing",Iowa,Mills,2010-09-04,,"Folsom Point Preserve",41.160724,-95.796995,"Aaron Brees",adult,Sighting,Photograph,1,,,,,,,,,
181995,,2016-046743,,"Erynnis baptisiae","Wild Indigo Duskywing",Iowa,Mills,2016-08-13,,"Folsom Point Preserve",41.16139,-95.795,"Mark Brown",adult,Sighting,Photograph,1,,,,,,,,,
207895,,2018-006060,,"Erynnis horatius","Horace's Duskywing",Iowa,Mills,2010-09-04,,"Folsom Point Preserve",41.16139,-95.795,"Aaron Brees",adult,Sighting,Photograph,1,,,,,,,,,
207905,,2018-006070,,"Erynnis funeralis","Funeral Duskywing",Iowa,Mills,2010-09-04,,"Folsom Point Preserve",41.161681,-95.798754,"Aaron Brees",adult,Sighting,Photograph,1,,,,,,,,,
317776,,,,"Erynnis baptisiae","Wild Indigo Duskywing",Iowa,Mills,2022-05-27,,"Folsom Point Preserve",41.154432,-95.799393,"Jay Gilliam",adult,Sighting,Photograph,1,,,,,,,,,
317947,,,,"Erynnis baptisiae","Wild Indigo Duskywing",Iowa,Mills,2022-06-18,,"Folsom Point Preserve",41.154432,-95.799393,"Jay Gilliam",adult,Sighting,Photograph,1,,,,,,,,,
318294,,,,"Erynnis baptisiae","Wild Indigo Duskywing",Iowa,Mills,2022-07-31,,"Folsom Point Preserve",41.154432,-95.799393,"Jay Gilliam",adult,Sighting,Photograph,1,,,,,,,,,
318474,,,,"Erynnis baptisiae","Wild Indigo Duskywing",Iowa,Mills,2022-08-27,,"Folsom Point Preserve",41.154432,-95.799393,"Jay Gilliam",adult,Sighting,Sighting,2,,,,,,,,,
346278,,,,"Erynnis funeralis","Funeral Duskywing",Iowa,Mills,2023-05-06,,"Folsom Point Preserve",41.154432,-95.799393,"Jay Gilliam",adult,Sighting,Photograph,1,,,,,,,,,6062
346373,,,,"Erynnis funeralis","Funeral Duskywing",Iowa,Mills,2023-05-06,,"Folsom Point Preserve",41.154432,-95.799393,"Jay Gilliam",adult,Sighting,Photograph,2,,,,,,,,,"5839, 5884"
346951,,,,"Erynnis baptisiae","Wild Indigo Duskywing",Iowa,Mills,2023-08-05,,"Folsom Point Preserve",41.154432,-95.799393,"Jay Gilliam",adult,Sighting,Sighting,2,,,,,,,,,
