ID,"Collection / Source","Catalog Number","Specify Number",Taxon,"Common Name",State,County,Date,Time,Locale,Latitude,Longitude,Collector,"Life Stage","Collection Method","Preparation Type",Count,Temperature,Humidity,"Dew Point",Wind,"Wind Direction","Barometric Pressure",Sky,"Moon Phase",Notes
264523,,,,"Limonia immatura",None,Iowa,Linn,2020-05-15,,"Hitaga Sand Ridge Prairie Preserve",42.250881,-91.632144,"Jim Durbin",adult,Blacklight/Fluorescent,Photograph,1,60,85,56,0,0,30.01,clear,"50% visible",
264956,,,,"Epiphragma solatrix",None,Iowa,Linn,2020-05-23,21:02:48,"Pinicon Ridge Park",42.21848617,-91.53895602,"Jim Durbin",adult,Blacklight/Fluorescent,Photograph,1,68,72,62,2,330,29.71,clear,"new moon",
264961,,,,"Epiphragma solatrix",None,Iowa,Linn,2020-05-23,21:02:48,"Pinicon Ridge Park",42.21848617,-91.53895602,"Jim Durbin",adult,Blacklight/Fluorescent,Photograph,1,68,72,62,2,330,29.71,clear,"new moon",
265056,,,,"Epiphragma fasciapenne","Band-winged Cranefly",Iowa,Linn,2020-05-27,21:31:32,"Matsell Bridge Natural Area",42.13204088,-91.38537304,"Jim Durbin",adult,Blacklight/Fluorescent,Photograph,1,73,94,72,0,280,29.89,cloudy,"10% visible",
265207,,,,"Epiphragma fasciapenne","Band-winged Cranefly",Iowa,Linn,2020-05-27,21:31:32,"Matsell Bridge Natural Area",42.13204088,-91.38537304,"Jim Durbin",adult,Blacklight/Fluorescent,Photograph,1,73,94,72,0,280,29.89,cloudy,"10% visible",
265293,,,,"Epiphragma fasciapenne","Band-winged Cranefly",Iowa,Linn,2020-06-01,21:34:37,"Rehrauer Natural Area",42.2551662,-91.4885161,"Jim Durbin",adult,Blacklight/Fluorescent,Photograph,1,,,,,,,,,
265765,,,,"Epiphragma fasciapenne","Band-winged Cranefly",Iowa,Linn,2020-06-05,22:21:10,"Hitaga Sand Ridge Prairie Preserve",42.25088607,-91.63212362,"Jim Durbin",adult,Blacklight/Fluorescent,Photograph,1,75,58,59,4,355,29.95,clear,Full,
265781,,,,"Erioptera venusta",None,Iowa,Linn,2020-06-05,22:21:10,"Hitaga Sand Ridge Prairie Preserve",42.25088607,-91.63212362,"Jim Durbin",adult,Blacklight/Fluorescent,Photograph,1,75,58,59,4,355,29.95,clear,Full,
265975,,,,"Epiphragma fasciapenne","Band-winged Cranefly",Iowa,Linn,2020-06-07,20:43:32,"Wickiup Hill Outdoor Learning Area",42.08736536,-91.76707659,"Jim Durbin",adult,Sighting,Photograph,1,81,49,60,4,170,29.77,clear,full,
271048,,,,"Erioptera venusta",None,Iowa,Linn,2020-09-02,20:44:22,"Matsell Bridge Natural Area",42.13215415,-91.38528784,"Jim Durbin",adult,Blacklight/Fluorescent,Photograph,1,75,43,48,0,0,29.31,cxlear,"full moon",
271410,,,,"Erioptera venusta",None,Iowa,Linn,2020-09-14,19:57:47,"Wickiup Hill Outdoor Learning Area",42.08735192,-91.76707176,"Jim Durbin",adult,Blacklight/Fluorescent,Photograph,1,71,68,60,3,100,29.65,cloudy,"10% visible",
272028,,,,"Erioptera venusta",None,Iowa,Linn,2020-09-16,20:03:04,"Hitaga Sand Ridge Prairie Preserve",42.25083834,-91.63212487,"Jim Durbin",adult,Sighting,Photograph,1,68,76,60,2,360,30.09,cloudy,"new moon",
272057,,,,"Erioptera venusta",None,Iowa,Linn,2020-09-16,20:03:32,"Hitaga Sand Ridge Prairie Preserve",42.25083834,-91.63212486666667,"Jim Durbin",adult,Sighting,Photograph,1,68,76,60,2,360,30.09,cloudy,"new moon",
287816,,,,"Epiphragma fasciapenne","Band-winged Cranefly",Iowa,Linn,2021-05-24,21:08:57,"Matsell Bridge Natural Area",42.13218947,-91.38528806,"Jim Durbin",adult,Blacklight/Fluorescent,Photograph,1,76,77,68,4,190,30,Cloudy,"full moon",
288207,,,,"Erioptera venusta",None,Iowa,Linn,2021-06-02,21:27:17,"Hitaga Sand Ridge Prairie Preserve",42.25092585,-91.63217796,"Jim Durbin",adult,Blacklight/Fluorescent,Photograph,1,65,69,55,,,29.91,clear,"6% visible",
309969,,,,"Erioptera venusta",None,Iowa,Linn,2022-06-09,20:35:15,"Matsell Bridge Natural Area",42.1322708,-91.38538363,"Jim Durbin",adult,Blacklight/Fluorescent,Photograph,1,68,59,53,0,0,29.95,cloudy,"60% visible",
310480,,,,"Erioptera venusta",None,Iowa,Linn,2022-06-16,22:01:47,"Wanatee County Park",42.01007932,-91.56651807,"Jim Durbin",adult,Blacklight/Fluorescent,Photograph,1,77,50,57,8,270,29.96,clear,full,
313152,,,,"Teucholabis undetermined",None,Iowa,Linn,2022-08-10,21:16:45,"Matsell Bridge Natural Area",42.13198835,-91.38532446,"Jim Durbin",adult,Blacklight/Fluorescent,Photograph,1,68,100,69,0,0,30.15,clear,full,
314570,,,,"Erioptera venusta",None,Iowa,Linn,2022-09-05,20:05:03,"Pinicon Ridge Park",42.21852221,-91.53890027,"Jim Durbin",adult,Blacklight/Fluorescent,Photograph,1,72,87,68,2,90,30.07,cloudy,"50% visible",
334991,,,,"Erioptera venusta",None,Iowa,Linn,2023-06-07,21:39:35,"Pinicon Ridge Park",42.210859176666666,-91.54448714333333,"Jim Durbin",adult,Sighting,Photograph,1,64,58,49,1,280,29.87,"partly cloudy","90% visible",
337099,,,,"Limnophila fuscovaria",None,Iowa,Linn,2023-07-08,21:11:40,"Palisades Kepler State Park",41.90829802,-91.50242489,"Jim Durbin",adult,Blacklight/Fluorescent,Photograph,1,73,55,53,7,330,29.89,clear,"80% visible",
337772,,,,"Erioptera venusta",None,Iowa,Linn,2023-07-16,21:42:37,"Matsell Bridge Natural Area",42.13217249,-91.38522877,"Jim Durbin",adult,Blacklight/Fluorescent,Photograph,1,73,70,63,4,220,29.87,cloudy,"10% visible",
341052,,,,"Erioptera venusta",None,Iowa,Linn,2023-08-31,20:23:44,"Palisades Kepler State Park",41.90835858,-91.50240348,"Jim Durbin",adult,Blacklight/Fluorescent,Photograph,1,65,54,48,8,100,30.06,clear,full,
341723,,,,"Limonia annulata",None,Iowa,Linn,2023-09-29,19:29:13,"Hitaga Sand Ridge Prairie Preserve",42.250745948333,-91.632190941667,"Jim Durbin",adult,Blacklight/Fluorescent,Photograph,1,78,75,65,9,160,30.03,clear,,
341732,,,,"Limonia annulata",None,Iowa,Linn,2023-09-29,19:45:04,"Hitaga Sand Ridge Prairie Preserve",42.250745948333,-91.632190941667,"Jim Durbin",adult,Blacklight/Fluorescent,Photograph,1,78,75,65,9,160,30.03,clear,,
