ID,"Collection / Source","Catalog Number","Specify Number",Taxon,"Common Name",State,County,Date,Time,Locale,Latitude,Longitude,Collector,"Life Stage","Collection Method","Preparation Type",Count,Temperature,Humidity,"Dew Point",Wind,"Wind Direction","Barometric Pressure",Sky,"Moon Phase",Notes
31188,"Jim Durbin Drawer 147",2014-031560,SPM008522,"Meropleon ambifusca","Newman's Brocade Moth",Iowa,Linn,2007-05-10,,"Pleasant Creek State Recreation Area, Linn County",42.11952,-91.81215,"Jim Durbin",adult,Blacklight/Fluorescent,Pinned,1,,,,,,,,,
37684,"Frank Olsen Drawer 30",2014-038058,SPM002611,"Meropleon ambifusca","Newman's Brocade Moth",Iowa,Linn,2004-09-09,,"Wickiup Hill Outdoor Learning Area",42.08398,-91.7651,"Frank Olsen",adult,,Pinned,1,,,,,,,,,"Located at Iowa State"
37685,"Frank Olsen Drawer 30",2014-038059,SPM013365,"Meropleon ambifusca","Newman's Brocade Moth",Iowa,Linn,2008-09-19,,"Pleasant Creek State Recreation Area, Linn County",42.11952,-91.81215,"Frank Olsen",adult,,Pinned,1,,,,,,,,,"Located at Iowa State"
37687,"Frank Olsen Drawer 30",2014-038061,SPM020784,"Meropleon ambifusca","Newman's Brocade Moth",Iowa,Linn,2010-09-09,,"Wickiup Hill Outdoor Learning Area",42.08398,-91.7651,"Frank Olsen",adult,,Pinned,1,,,,,,,,,"Located at Iowa State"
37688,"Frank Olsen Drawer 30",2014-038062,SPM020800,"Meropleon ambifusca","Newman's Brocade Moth",Iowa,Linn,2010-09-14,,"Wickiup Hill Outdoor Learning Area",42.08398,-91.7651,"Frank Olsen",adult,,Pinned,1,,,,,,,,,"Located at Iowa State"
39160,"Jim Durbin Drawer 147",2014-039534,SPM009366,"Meropleon ambifusca","Newman's Brocade Moth",Iowa,Linn,2007-08-21,,"Wickiup Hill Outdoor Learning Area",42.08398,-91.7651,"Jim Durbin",adult,Blacklight/Fluorescent,Pinned,1,,,,,,,,,
50105,,2014-050487,,"Meropleon ambifusca","Newman's Brocade Moth",Iowa,Linn,2014-08-18,2030-2300DST,"Wanatee County Park",42.01007,-91.566739,"Jim Durbin",adult,Blacklight/Fluorescent,Photograph,1,77-74,75-86,68,,,29.73,Clear,,
65127,"Jim Durbin Drawer 147",2014-065728,,"Meropleon ambifusca","Newman's Brocade Moth",Iowa,Linn,2014-08-30,2000-2300DST,"Pleasant Creek State Recreation Area, Linn County",42.110327,-91.822988,"Jim Durbin",adult,Blacklight/Fluorescent,Pinned,1,77-69,73-97,68-66,4,0,29.88,"Partly Cloudy",,
65199,"Jim Durbin Drawer 147",2014-065800,,"Meropleon ambifusca","Newman's Brocade Moth",Iowa,Linn,2014-08-30,2000-2300DST,"Pleasant Creek State Recreation Area, Linn County",42.110327,-91.822988,"Jim Durbin",adult,Blacklight/Fluorescent,Pinned,1,77-69,73-97,68-66,4,0,29.88,"Partly Cloudy",,
65532,,2014-066134,,"Meropleon ambifusca","Newman's Brocade Moth",Iowa,Linn,2014-09-19,1930-2200DST,"Pleasant Creek State Recreation Area, Linn County",42.110327,-91.822988,"Jim Durbin",adult,Blacklight/Fluorescent,Photograph,1,70-67,68-75,59,12,180,29.86,,none,
129239,"Jim Durbin Drawer 147",2015-019829,,"Meropleon ambifusca","Newman's Brocade Moth",Iowa,Linn,2015-08-03,"2045 - 2300","Matsell Bridge Natural Area",42.131959,-91.388307,"Jim Durbin",adult,Blacklight/Fluorescent,Pinned,1,72,78,58,5,270,29.92,Clear,"90% visible",
129340,,2015-019930,,"Meropleon ambifusca","Newman's Brocade Moth",Iowa,Linn,2015-08-21,2030-2230,"Indian Creek Nature Center",41.968932,-91.586884,"Jim Durbin",adult,Blacklight/Fluorescent,Sighting,2,73,61,58,4,160,29.95,clear,"30% visible",
129448,"Jim Durbin Drawer 147",2015-020038,,"Meropleon ambifusca","Newman's Brocade Moth",Iowa,Linn,2015-08-21,2030-2230,"Indian Creek Nature Center",41.968932,-91.586884,"Jim Durbin",adult,Blacklight/Fluorescent,Pinned,1,73,61,58,4,160,29.95,clear,"30% visible",
129504,,2015-020094,,"Meropleon ambifusca","Newman's Brocade Moth",Iowa,Linn,2015-08-26,"2015 - 2030","Indian Creek Nature Center",41.968932,-91.586884,"Jim Durbin",adult,Blacklight/Fluorescent,Photograph,1,63,93,61,3,210,30.12,clear,"80 % visible",
129509,,2015-020099,,"Meropleon ambifusca","Newman's Brocade Moth",Iowa,Linn,2015-08-26,"2015 - 2030","Indian Creek Nature Center",41.968932,-91.586884,"Jim Durbin",adult,Blacklight/Fluorescent,Photograph,1,63,93,61,3,210,30.12,clear,"80 % visible",
129528,,2015-020118,,"Meropleon ambifusca","Newman's Brocade Moth",Iowa,Linn,2015-08-26,"2015 - 2030","Indian Creek Nature Center",41.968932,-91.586884,"Jim Durbin",adult,Blacklight/Fluorescent,Photograph,1,63,93,61,3,210,30.12,clear,"80 % visible",
173633,,2016-038383,,"Meropleon ambifusca","Newman's Brocade Moth",Iowa,Linn,2016-08-03,2100-2330,"Hitaga Sand Ridge Prairie Preserve",42.250957,-91.632098,"Jim Durbin",adult,Blacklight/Fluorescent,Photograph,1,81,74,71,3,180,29.96,clear,Dark,
173678,,2016-038428,,"Meropleon ambifusca","Newman's Brocade Moth",Iowa,Linn,2016-08-03,2100-2330,"Hitaga Sand Ridge Prairie Preserve",42.250957,-91.632098,"Jim Durbin",adult,Blacklight/Fluorescent,Photograph,1,81,74,71,3,180,29.96,clear,Dark,
174558,,2016-039308,,"Meropleon ambifusca","Newman's Brocade Moth",Iowa,Linn,2016-08-15,2030-2300,"Hitaga Sand Ridge Prairie Preserve",42.250957,-91.632098,"Jim Durbin",adult,Blacklight/Fluorescent,Photograph,1,75,74,66,0,0,29096,cloudy,full,
174602,,2016-039352,,"Meropleon ambifusca","Newman's Brocade Moth",Iowa,Linn,2016-08-15,2030-2300,"Hitaga Sand Ridge Prairie Preserve",42.250957,-91.632098,"Jim Durbin",adult,Blacklight/Fluorescent,Photograph,1,75,74,66,0,0,29096,cloudy,full,
174648,,2016-039398,,"Meropleon ambifusca","Newman's Brocade Moth",Iowa,Linn,2016-08-15,2030-2300,"Hitaga Sand Ridge Prairie Preserve",42.250957,-91.632098,"Jim Durbin",adult,Blacklight/Fluorescent,Photograph,1,75,74,66,0,0,29096,cloudy,full,
174657,,2016-039407,,"Meropleon ambifusca","Newman's Brocade Moth",Iowa,Linn,2016-08-15,2030-2300,"Hitaga Sand Ridge Prairie Preserve",42.250957,-91.632098,"Jim Durbin",adult,Blacklight/Fluorescent,Photograph,1,75,74,66,0,0,29096,cloudy,full,
174715,,2016-039465,,"Meropleon ambifusca","Newman's Brocade Moth",Iowa,Linn,2016-08-15,2030-2300,"Hitaga Sand Ridge Prairie Preserve",42.250957,-91.632098,"Jim Durbin",adult,Blacklight/Fluorescent,Photograph,1,75,74,66,0,0,29096,cloudy,full,
174719,,2016-039469,,"Meropleon ambifusca","Newman's Brocade Moth",Iowa,Linn,2016-08-15,2030-2300,"Hitaga Sand Ridge Prairie Preserve",42.250957,-91.632098,"Jim Durbin",adult,Blacklight/Fluorescent,Photograph,1,75,74,66,0,0,29096,cloudy,full,
174725,,2016-039475,,"Meropleon ambifusca","Newman's Brocade Moth",Iowa,Linn,2016-08-15,2030-2300,"Hitaga Sand Ridge Prairie Preserve",42.250957,-91.632098,"Jim Durbin",adult,Blacklight/Fluorescent,Photograph,1,75,74,66,0,0,29096,cloudy,full,
174746,,2016-039496,,"Meropleon ambifusca","Newman's Brocade Moth",Iowa,Linn,2016-08-21,2030-2300,"Hitaga Sand Ridge Prairie Preserve",42.250957,-91.632098,"Jim Durbin",adult,Blacklight/Fluorescent,Photograph,1,64,74,55,0,0,30,clear,"80% visible",
174807,,2016-039557,,"Meropleon ambifusca","Newman's Brocade Moth",Iowa,Linn,2016-08-21,2030-2300,"Hitaga Sand Ridge Prairie Preserve",42.250957,-91.632098,"Jim Durbin",adult,Blacklight/Fluorescent,Photograph,1,64,74,55,0,0,30,clear,"80% visible",
174833,,2016-039583,,"Meropleon ambifusca","Newman's Brocade Moth",Iowa,Linn,2016-08-21,2030-2300,"Hitaga Sand Ridge Prairie Preserve",42.250957,-91.632098,"Jim Durbin",adult,Blacklight/Fluorescent,Photograph,1,64,74,55,0,0,30,clear,"80% visible",
174943,,2016-039693,,"Meropleon ambifusca","Newman's Brocade Moth",Iowa,Linn,2016-08-21,2030-2300,"Hitaga Sand Ridge Prairie Preserve",42.250957,-91.632098,"Jim Durbin",adult,Blacklight/Fluorescent,Photograph,1,64,74,55,0,0,30,clear,"80% visible",
174962,,2016-039712,,"Meropleon ambifusca","Newman's Brocade Moth",Iowa,Linn,2016-08-21,2030-2300,"Hitaga Sand Ridge Prairie Preserve",42.250957,-91.632098,"Jim Durbin",adult,Blacklight/Fluorescent,Photograph,1,64,74,55,0,0,30,clear,"80% visible",
175029,,2016-039779,,"Meropleon ambifusca","Newman's Brocade Moth",Iowa,Linn,2016-08-21,2030-2300,"Hitaga Sand Ridge Prairie Preserve",42.250957,-91.632098,"Jim Durbin",adult,Blacklight/Fluorescent,Photograph,1,64,74,55,0,0,30,clear,"80% visible",
175032,,2016-039782,,"Meropleon ambifusca","Newman's Brocade Moth",Iowa,Linn,2016-08-21,2030-2300,"Hitaga Sand Ridge Prairie Preserve",42.250957,-91.632098,"Jim Durbin",adult,Blacklight/Fluorescent,Photograph,1,64,74,55,0,0,30,clear,"80% visible",
175082,,2016-039832,,"Meropleon ambifusca","Newman's Brocade Moth",Iowa,Linn,2016-08-28,2000-2230,"Hitaga Sand Ridge Prairie Preserve",42.250957,-91.632098,"Jim Durbin",adult,Blacklight/Fluorescent,Photograph,1,74,83,74,9,110,30.1,cloudy,"10% visible","Rained for about 15 minutes at 8:00PM"
175134,,2016-039884,,"Meropleon ambifusca","Newman's Brocade Moth",Iowa,Linn,2016-08-28,2000-2230,"Hitaga Sand Ridge Prairie Preserve",42.250957,-91.632098,"Jim Durbin",adult,Blacklight/Fluorescent,Photograph,1,74,83,74,9,110,30.1,cloudy,"10% visible","Rained for about 15 minutes at 8:00PM"
175224,,2016-039974,,"Meropleon ambifusca","Newman's Brocade Moth",Iowa,Linn,2016-08-28,2000-2230,"Hitaga Sand Ridge Prairie Preserve",42.250957,-91.632098,"Jim Durbin",adult,Blacklight/Fluorescent,Photograph,1,74,83,74,9,110,30.1,cloudy,"10% visible","Rained for about 15 minutes at 8:00PM"
175231,,2016-039981,,"Meropleon ambifusca","Newman's Brocade Moth",Iowa,Linn,2016-08-28,2000-2230,"Hitaga Sand Ridge Prairie Preserve",42.250957,-91.632098,"Jim Durbin",adult,Blacklight/Fluorescent,Photograph,1,74,83,74,9,110,30.1,cloudy,"10% visible","Rained for about 15 minutes at 8:00PM"
176322,,2016-041072,,"Meropleon ambifusca","Newman's Brocade Moth",Iowa,Linn,2016-09-05,,"Hitaga Sand Ridge Prairie Preserve",42.250957,-91.632098,"Jim Durbin",adult,Blacklight/Fluorescent,Photograph,1,81,61,71,12,190,29090,clear,"10% visible",
176427,,2016-041177,,"Meropleon ambifusca","Newman's Brocade Moth",Iowa,Linn,2016-09-11,2000-2200,"Hitaga Sand Ridge Prairie Preserve",42.250957,-91.632098,"Jim Durbin",adult,Blacklight/Fluorescent,Photograph,1,76,40,50,5,120,29.99,clear,"80% visible",
195394,,2017-013358,,"Meropleon ambifusca","Newman's Brocade Moth",Iowa,Linn,2017-08-14,2030-2300,"Hitaga Sand Ridge Prairie Preserve",42.250957,-91.632098,"Jim Durbin",adult,Blacklight/Fluorescent,Photograph,1,72,97,71,0,0,29.81,clear,"60% visible",
195446,,2017-013410,,"Meropleon ambifusca","Newman's Brocade Moth",Iowa,Linn,2017-08-14,2030-2300,"Hitaga Sand Ridge Prairie Preserve",42.250957,-91.632098,"Jim Durbin",adult,Blacklight/Fluorescent,Photograph,1,72,97,71,0,0,29.81,clear,"60% visible",
195571,,2017-013535,,"Meropleon ambifusca","Newman's Brocade Moth",Iowa,Linn,2017-08-18,2030-2300,"Wickiup Hill Outdoor Learning Area",42.087567,-91.767578,"Jim Durbin",adult,Blacklight/Fluorescent,Photograph,1,71,73,62,5,10,29.88,clear,"20% visible",
195575,,2017-013539,,"Meropleon ambifusca","Newman's Brocade Moth",Iowa,Linn,2017-08-18,2030-2300,"Wickiup Hill Outdoor Learning Area",42.087567,-91.767578,"Jim Durbin",adult,Blacklight/Fluorescent,Photograph,1,71,73,62,5,10,29.88,clear,"20% visible",
195748,,2017-013712,,"Meropleon ambifusca","Newman's Brocade Moth",Iowa,Linn,2017-08-23,2000-2300,"Hitaga Sand Ridge Prairie Preserve",42.250957,-91.632098,"Jim Durbin",adult,Blacklight/Fluorescent,Photograph,1,66,84,61,,,30.03,clear,"0 visible",
195753,,2017-013717,,"Meropleon ambifusca","Newman's Brocade Moth",Iowa,Linn,2017-08-23,2000-2300,"Hitaga Sand Ridge Prairie Preserve",42.250957,-91.632098,"Jim Durbin",adult,Blacklight/Fluorescent,Photograph,1,66,84,61,,,30.03,clear,"0 visible",
195865,,2017-013829,,"Meropleon ambifusca","Newman's Brocade Moth",Iowa,Linn,2017-08-23,2000-2300,"Hitaga Sand Ridge Prairie Preserve",42.250957,-91.632098,"Jim Durbin",adult,Blacklight/Fluorescent,Photograph,1,66,84,61,,,30.03,clear,"0 visible",
195905,,2017-013869,,"Meropleon ambifusca","Newman's Brocade Moth",Iowa,Linn,2017-08-23,2000-2300,"Hitaga Sand Ridge Prairie Preserve",42.250957,-91.632098,"Jim Durbin",adult,Blacklight/Fluorescent,Photograph,1,66,84,61,,,30.03,clear,"0 visible",
196071,,2017-014035,,"Meropleon ambifusca","Newman's Brocade Moth",Iowa,Linn,2017-08-30,2000-2300,"Hitaga Sand Ridge Prairie Preserve",42.250957,-91.632098,"Jim Durbin",adult,Blacklight/Fluorescent,Photograph,1,70,90,68,0,0,30.07,clear,"50% visible",
196167,,2017-014131,,"Meropleon ambifusca","Newman's Brocade Moth",Iowa,Linn,2017-08-30,2000-2300,"Hitaga Sand Ridge Prairie Preserve",42.250957,-91.632098,"Jim Durbin",adult,Blacklight/Fluorescent,Photograph,1,70,90,68,0,0,30.07,clear,"50% visible",
196169,,2017-014133,,"Meropleon ambifusca","Newman's Brocade Moth",Iowa,Linn,2017-08-30,2000-2300,"Hitaga Sand Ridge Prairie Preserve",42.250957,-91.632098,"Jim Durbin",adult,Blacklight/Fluorescent,Photograph,1,70,90,68,0,0,30.07,clear,"50% visible",
196204,,2017-014168,,"Meropleon ambifusca","Newman's Brocade Moth",Iowa,Linn,2017-08-30,2000-2300,"Hitaga Sand Ridge Prairie Preserve",42.250957,-91.632098,"Jim Durbin",adult,Blacklight/Fluorescent,Photograph,1,70,90,68,0,0,30.07,clear,"50% visible",
196378,,2017-014312,,"Meropleon ambifusca","Newman's Brocade Moth",Iowa,Linn,2017-09-14,1945-2230,"Hitaga Sand Ridge Prairie Preserve",42.250957,-91.632098,"Jim Durbin",adult,Blacklight/Fluorescent,Photograph,1,76,68,66,4,145,29.85,cloudy,"40 % visible",
196497,,2017-014431,,"Meropleon ambifusca","Newman's Brocade Moth",Iowa,Linn,2017-09-14,1945-2230,"Hitaga Sand Ridge Prairie Preserve",42.250957,-91.632098,"Jim Durbin",adult,Blacklight/Fluorescent,Photograph,1,76,68,66,4,145,29.85,cloudy,"40 % visible",
196498,,2017-014432,,"Meropleon ambifusca","Newman's Brocade Moth",Iowa,Linn,2017-09-14,1945-2230,"Hitaga Sand Ridge Prairie Preserve",42.250957,-91.632098,"Jim Durbin",adult,Blacklight/Fluorescent,Photograph,1,76,68,66,4,145,29.85,cloudy,"40 % visible",
196524,,2017-014458,,"Meropleon ambifusca","Newman's Brocade Moth",Iowa,Linn,2017-09-14,1945-2230,"Hitaga Sand Ridge Prairie Preserve",42.250957,-91.632098,"Jim Durbin",adult,Blacklight/Fluorescent,Photograph,1,76,68,66,4,145,29.85,cloudy,"40 % visible",
196529,,2017-014463,,"Meropleon ambifusca","Newman's Brocade Moth",Iowa,Linn,2017-09-14,1945-2230,"Hitaga Sand Ridge Prairie Preserve",42.250957,-91.632098,"Jim Durbin",adult,Blacklight/Fluorescent,Photograph,1,76,68,66,4,145,29.85,cloudy,"40 % visible",
196546,,2017-014480,,"Meropleon ambifusca","Newman's Brocade Moth",Iowa,Linn,2017-09-14,1945-2230,"Hitaga Sand Ridge Prairie Preserve",42.250957,-91.632098,"Jim Durbin",adult,Blacklight/Fluorescent,Photograph,1,76,68,66,4,145,29.85,cloudy,"40 % visible",
196547,,2017-014481,,"Meropleon ambifusca","Newman's Brocade Moth",Iowa,Linn,2017-09-14,1945-2230,"Hitaga Sand Ridge Prairie Preserve",42.250957,-91.632098,"Jim Durbin",adult,Blacklight/Fluorescent,Photograph,1,76,68,66,4,145,29.85,cloudy,"40 % visible",
196550,,2017-014484,,"Meropleon ambifusca","Newman's Brocade Moth",Iowa,Linn,2017-09-14,1945-2230,"Hitaga Sand Ridge Prairie Preserve",42.250957,-91.632098,"Jim Durbin",adult,Blacklight/Fluorescent,Photograph,1,76,68,66,4,145,29.85,cloudy,"40 % visible",
196552,,2017-014486,,"Meropleon ambifusca","Newman's Brocade Moth",Iowa,Linn,2017-09-14,1945-2230,"Hitaga Sand Ridge Prairie Preserve",42.250957,-91.632098,"Jim Durbin",adult,Blacklight/Fluorescent,Photograph,1,76,68,66,4,145,29.85,cloudy,"40 % visible",
196601,"Jim Durbin Drawer 147",2017-014173,,"Meropleon ambifusca","Newman's Brocade Moth",Iowa,Linn,2017-08-30,2000-2300,"Hitaga Sand Ridge Prairie Preserve",42.250957,-91.632098,"Jim Durbin",adult,Blacklight/Fluorescent,Pinned,1,70,90,68,0,0,30.07,clear,"50% visible",
219237,,2018-017393,,"Meropleon ambifusca","Newman's Brocade Moth",Iowa,Linn,2018-08-19,,"Wickiup Hill Outdoor Learning Area",42.087352,-91.767107,"Jim Durbin",adult,Blacklight/Fluorescent,Photograph,1,75,72,65,3,90,29.84,"partly cloudy","50% visible",
219504,,2018-017660,,"Meropleon ambifusca","Newman's Brocade Moth",Iowa,Linn,2018-08-25,2015-2300,"Hitaga Sand Ridge Prairie Preserve",42.250604,-91.629962,"Jim Durbin",adult,Blacklight/Fluorescent,Photograph,1,74,97,73,3,310,29.91,cdlear,"Full Moon",
219511,,2018-017667,,"Meropleon ambifusca","Newman's Brocade Moth",Iowa,Linn,2018-08-25,2015-2300,"Hitaga Sand Ridge Prairie Preserve",42.250604,-91.629962,"Jim Durbin",adult,Blacklight/Fluorescent,Photograph,1,74,97,73,3,310,29.91,cdlear,"Full Moon",
219838,"Jim Durbin Drawer 147",2018-017806,,"Meropleon ambifusca","Newman's Brocade Moth",Iowa,Linn,2018-08-25,2015-2300,"Hitaga Sand Ridge Prairie Preserve",42.250604,-91.629962,"Jim Durbin",adult,Blacklight/Fluorescent,Pinned,1,74,97,73,3,310,29.91,cdlear,"Full Moon",
220271,,2018-018427,,"Meropleon ambifusca","Newman's Brocade Moth",Iowa,Linn,2018-09-11,1945-2300,"Hitaga Sand Ridge Prairie Preserve",42.25095,-91.63209,"Jim Durbin",adult,Blacklight/Fluorescent,Photograph,1,73,64,60,2,110,30.02,clear,dark,
224414,"Jim Durbin Drawer 147",2018-022549,,"Meropleon ambifusca","Newman's Brocade Moth",Iowa,Linn,2018-08-25,,"Hitaga Sand Ridge Prairie Preserve",42.250957,-91.632098,"Jim Durbin",adult,Blacklight/Fluorescent,Pinned,1,,,,,,,,,
235993,,,,"Meropleon ambifusca","Newman's Brocade Moth",Iowa,Linn,2019-08-14,2030-2300,"Hitaga Sand Ridge Prairie Preserve",42.250886,-91.632106,"Jim Durbin",adult,Sighting,Photograph,1,68,89,65,2,260,29.91,"partly cloidy",full,
236162,,,,"Meropleon ambifusca","Newman's Brocade Moth",Iowa,Linn,2019-08-14,2030-2300,"Hitaga Sand Ridge Prairie Preserve",42.250886,-91.632106,"Jim Durbin",adult,Sighting,Photograph,1,68,89,65,2,260,29.91,"partly cloidy",full,
236528,,,,"Meropleon ambifusca","Newman's Brocade Moth",Iowa,Linn,2019-08-19,2030-2300,"Wickiup Hill Outdoor Learning Area",42.087352,-91.767107,"Jim Durbin",adult,Blacklight/Fluorescent,Photograph,1,74,81,68,2,90,29.88,"partly cloudy","90% visible",
236529,,,,"Meropleon ambifusca","Newman's Brocade Moth",Iowa,Linn,2019-08-19,2030-2300,"Wickiup Hill Outdoor Learning Area",42.087352,-91.767107,"Jim Durbin",adult,Blacklight/Fluorescent,Photograph,1,74,81,68,2,90,29.88,"partly cloudy","90% visible",
236548,,,,"Meropleon ambifusca","Newman's Brocade Moth",Iowa,Linn,2019-08-19,2030-2300,"Wickiup Hill Outdoor Learning Area",42.087352,-91.767107,"Jim Durbin",adult,Blacklight/Fluorescent,Photograph,1,74,81,68,2,90,29.88,"partly cloudy","90% visible",
236549,,,,"Meropleon ambifusca","Newman's Brocade Moth",Iowa,Linn,2019-08-19,2030-2300,"Wickiup Hill Outdoor Learning Area",42.087352,-91.767107,"Jim Durbin",adult,Blacklight/Fluorescent,Photograph,1,74,81,68,2,90,29.88,"partly cloudy","90% visible",
236550,,,,"Meropleon ambifusca","Newman's Brocade Moth",Iowa,Linn,2019-08-19,2030-2300,"Wickiup Hill Outdoor Learning Area",42.087352,-91.767107,"Jim Durbin",adult,Blacklight/Fluorescent,Photograph,1,74,81,68,2,90,29.88,"partly cloudy","90% visible",
237967,,,,"Meropleon ambifusca","Newman's Brocade Moth",Iowa,Linn,2019-09-05,"2000 - 2300","Wickiup Hill Outdoor Learning Area",42.087352,-91.767107,"Jim Durbin",adult,Blacklight/Fluorescent,Photograph,1,72,71,62,3,100,29.81,clear,"50% visible",
238088,,,,"Meropleon ambifusca","Newman's Brocade Moth",Iowa,Linn,2019-09-05,"2000 - 2300","Wickiup Hill Outdoor Learning Area",42.087352,-91.767107,"Jim Durbin",adult,Blacklight/Fluorescent,Photograph,1,72,71,62,3,100,29.81,clear,"50% visible",
271434,,,,"Meropleon ambifusca","Newman's Brocade Moth",Iowa,Linn,2020-09-14,20:16:37,"Wickiup Hill Outdoor Learning Area",42.08735192,-91.76707176,"Jim Durbin",adult,Blacklight/Fluorescent,Photograph,1,71,68,60,3,100,29.65,cloudy,"10% visible",
271478,,,,"Meropleon ambifusca","Newman's Brocade Moth",Iowa,Linn,2020-09-14,20:46:41,"Wickiup Hill Outdoor Learning Area",42.08735192,-91.76707176,"Jim Durbin",adult,Blacklight/Fluorescent,Photograph,1,71,68,60,3,100,29.65,cloudy,"10% visible",
271502,,,,"Meropleon ambifusca","Newman's Brocade Moth",Iowa,Linn,2020-09-14,20:56:18,"Wickiup Hill Outdoor Learning Area",42.08735192,-91.76707176,"Jim Durbin",adult,Blacklight/Fluorescent,Photograph,1,71,68,60,3,100,29.65,cloudy,"10% visible",
271512,,,,"Meropleon ambifusca","Newman's Brocade Moth",Iowa,Linn,2020-09-14,20:59:58,"Wickiup Hill Outdoor Learning Area",42.08735192,-91.76707176,"Jim Durbin",adult,Blacklight/Fluorescent,Photograph,1,71,68,60,3,100,29.65,cloudy,"10% visible",
271580,,,,"Meropleon ambifusca","Newman's Brocade Moth",Iowa,Linn,2020-09-14,21:32:11,"Wickiup Hill Outdoor Learning Area",42.08735192,-91.76707176,"Jim Durbin",adult,Blacklight/Fluorescent,Photograph,1,71,68,60,3,100,29.65,cloudy,"10% visible",
271586,,,,"Meropleon ambifusca","Newman's Brocade Moth",Iowa,Linn,2020-09-14,21:36:19,"Wickiup Hill Outdoor Learning Area",42.08735192,-91.76707176,"Jim Durbin",adult,Blacklight/Fluorescent,Photograph,1,71,68,60,3,100,29.65,cloudy,"10% visible",
272051,,,,"Meropleon ambifusca","Newman's Brocade Moth",Iowa,Linn,2020-09-16,20:45:24,"Hitaga Sand Ridge Prairie Preserve",42.25083834,-91.63212487,"Jim Durbin",adult,Sighting,Photograph,1,68,76,60,2,360,30.09,cloudy,"new moon",
274833,"Frank Olsen Drawer 40",2020-000737,,"Meropleon ambifusca","Newman's Brocade Moth",Iowa,Linn,2012-09-16,,"Wickiup Hill Outdoor Learning Area",42.08398,-91.7651,"Frank Olsen",adult,,Pinned,1,,,,,,,,,"Located at Iowa State"
274834,"Frank Olsen Drawer 40",2020-000738,,"Meropleon ambifusca","Newman's Brocade Moth",Iowa,Linn,2012-08-31,,"Wickiup Hill Outdoor Learning Area",42.08398,-91.7651,"Frank Olsen",adult,,Pinned,1,,,,,,,,,"Located at Iowa State"
274835,"Frank Olsen Drawer 40",2020-000739,,"Meropleon ambifusca","Newman's Brocade Moth",Iowa,Linn,2012-08-14,,"Wickiup Hill Outdoor Learning Area",42.08398,-91.7651,"Frank Olsen",adult,,Pinned,1,,,,,,,,,"Located at Iowa State"
291952,,,,"Meropleon ambifusca","Newman's Brocade Moth",Iowa,Linn,2021-08-15,22:19:24,"Pinicon Ridge Park",42.21087488,-91.54432767,"Jim Durbin",adult,Blacklight/Fluorescent,Photograph,1,72,46,50,3,90,29.96,clear,"50% visible",
308887,"Jim Durbin Drawer 147",2022-000159,,"Meropleon ambifusca","Newman's Brocade Moth",Iowa,Linn,2009-09-10,,"Rock Island Botanical State Preserve",42.026575,-91.727557,"Frank Olsen",adult,Blacklighting,Pinned,1,,,,,,,,,
313568,,,,"Meropleon ambifusca","Newman's Brocade Moth",Iowa,Linn,2022-08-17,22:17:40,"Wanatee County Park",42.01012074,-91.56658753,"Jim Durbin",adult,Blacklight/Fluorescent,Photograph,1,68,91,65,0,0,30.08,clear,"80% visible",
313825,,,,"Meropleon ambifusca","Newman's Brocade Moth",Iowa,Linn,2022-08-25,21:38:57,"Hitaga Sand Ridge Prairie Preserve",42.25103416,-91.63218888,"Jim Durbin",adult,Blacklight/Fluorescent,Photograph,1,73,90,70,2,350,30.03,clear,"10% visible",
313829,,,,"Meropleon ambifusca","Newman's Brocade Moth",Iowa,Linn,2022-08-25,21:37:31,"Hitaga Sand Ridge Prairie Preserve",42.25103416,-91.63218888,"Jim Durbin",adult,Blacklight/Fluorescent,Photograph,1,73,90,70,2,350,30.03,clear,"10% visible",
313869,,,,"Meropleon ambifusca","Newman's Brocade Moth",Iowa,Linn,2022-08-25,21:17:18,"Hitaga Sand Ridge Prairie Preserve",42.25103416,-91.63218888,"Jim Durbin",adult,Blacklight/Fluorescent,Photograph,1,73,90,70,2,350,30.03,clear,"10% visible",
314496,,,,"Meropleon ambifusca","Newman's Brocade Moth",Iowa,Linn,2022-09-05,21:04:40,"Pinicon Ridge Park",42.21852221,-91.53890027,"Jim Durbin",adult,Blacklight/Fluorescent,Photograph,1,72,87,68,2,90,30.07,cloudy,"50% visible",
