ID,"Collection / Source","Catalog Number","Specify Number",Taxon,"Common Name",State,County,Date,Time,Locale,Latitude,Longitude,Collector,"Life Stage","Collection Method","Preparation Type",Count,Temperature,Humidity,"Dew Point",Wind,"Wind Direction","Barometric Pressure",Sky,"Moon Phase",Notes
11519,,2014-011801,SPM039700,"Anisodactylus discoideus",None,Iowa,Linn,2014-05-07,,"Matsell Bridge Natural Area",42.13131,-91.38886,"Jim Durbin",adult,Blacklight/Fluorescent,Photograph,1,,,,,,,,,
11520,,2014-011802,SPM039701,"Anisodactylus discoideus",None,Iowa,Linn,2014-05-07,,"Matsell Bridge Natural Area",42.13131,-91.38886,"Jim Durbin",adult,Blacklight/Fluorescent,Photograph,1,,,,,,,,,
15570,"Jim Durbin Drawer 306-05",2014-015866,SPM001201,"Anisodactylus discoideus",None,Iowa,Linn,2004-04-28,,"Wickiup Hill Outdoor Learning Area",42.08398,-91.7651,"Jim Durbin",adult,Sighting,Pinned,1,,,,,,,,,
15571,"Jim Durbin Drawer 306-05",2014-015867,SPM001202,"Anisodactylus discoideus",None,Iowa,Linn,2004-04-28,,"Wickiup Hill Outdoor Learning Area",42.08398,-91.7651,"Jim Durbin",adult,Sighting,Pinned,1,,,,,,,,,
15572,"Jim Durbin Drawer 306-05",2014-015868,SPM001240,"Anisodactylus discoideus",None,Iowa,Linn,2004-06-11,,"Wickiup Hill Outdoor Learning Area",42.08398,-91.7651,"Jim Durbin",adult,Sighting,Pinned,1,,,,,,,,,
15573,"Jim Durbin Drawer 306-05",2014-015869,SPM001244,"Anisodactylus discoideus",None,Iowa,Linn,2004-06-11,,"Wickiup Hill Outdoor Learning Area",42.08398,-91.7651,"Jim Durbin",adult,Sighting,Pinned,1,,,,,,,,,
15574,"Jim Durbin Drawer 306-05",2014-015870,SPM005044,"Anisodactylus discoideus",None,Iowa,Linn,2005-06-11,,"Wickiup Hill Outdoor Learning Area",42.08398,-91.7651,"Jim Durbin",adult,Sighting,Pinned,1,,,,,,,,,
15575,"Jim Durbin Drawer 306-05",2014-015871,SPM006608,"Anisodactylus discoideus",None,Iowa,Linn,2006-06-15,,"Wanatee County Park",42.0094,-91.56623,"Jim Durbin",adult,Sighting,Pinned,1,,,,,,,,,
18660,"Jim Durbin Drawer 306-05",2014-018983,SPM005057,"Anisodactylus discoideus",None,Iowa,Linn,2005-06-03,,"Wickiup Hill Outdoor Learning Area",42.08398,-91.7651,"Jim Durbin",adult,Blacklight/Fluorescent,Pinned,1,,,,,,,,,
167120,,2016-031865,,"Anisodactylus discoideus",None,Iowa,Linn,2016-05-23,2030-2300,"Matsell Bridge Natural Area",42.131126,-91.388999,"Jim Durbin",adult,Blacklight/Fluorescent,Photograph,1,74,42,50,7,130,29.82,clear,Full,
192668,,2017-010629,,"Anisodactylus discoideus",None,Iowa,Linn,2017-06-14,2100-2330,"Wickiup Hill Outdoor Learning Area",42.087567,-91.767578,"Jim Durbin",adult,Blacklight/Fluorescent,Photograph,1,80,73,71,3,120,29.75,cloudy,"90% visible",
209645,,2018-007802,,"Anisodactylus discoideus",None,Iowa,Linn,2018-05-04,"2030 - 2300","Wickiup Hill Outdoor Learning Area",42.087352,-91.767107,"Jim Durbin",adult,Blacklight/Fluorescent,Photograph,1,67,38,41,0,0,29.95,clear,"95% visible",
211076,,2018-009233,,"Anisodactylus discoideus",None,Iowa,Linn,2018-05-24,2045-2300,"Matsell Bridge Natural Area",42.127011,-91.381076,"Jim Durbin",adult,Blacklight/Fluorescent,Photograph,1,82,54,,2,170,29.97,clear,"50% visible",
211115,,2018-009272,,"Anisodactylus discoideus",None,Iowa,Linn,2018-05-24,2045-2300,"Matsell Bridge Natural Area",42.127011,-91.381076,"Jim Durbin",adult,Blacklight/Fluorescent,Photograph,1,82,54,,2,170,29.97,clear,"50% visible",
211965,,2018-010122,,"Anisodactylus discoideus",None,Iowa,Linn,2018-06-07,,"Wickiup Hill Outdoor Learning Area",42.087352,-91.767107,"Jim Durbin",adult,Sighting,Photograph,1,,,,,,,,,
214516,,2018-012672,,"Anisodactylus sanctaecrucis",None,Iowa,Linn,2018-07-09,2100-2330,"Hitaga Sand Ridge Prairie Preserve",42.250957,-91.632098,"Jim Durbin",adult,Blacklight/Fluorescent,Photograph,1,80,79,73,0,0,30.11,clear,"20% visible",
214690,,2018-012846,,"Anisodactylus discoideus",None,Iowa,Linn,2018-07-12,2100-2330,"Matsell Bridge Natural Area",42.132148,-91.385221,"Jim Durbin",adult,Blacklight/Fluorescent,Photograph,1,88,56,70,6,90,30.04,clear,"0 visible",
217066,,2018-015222,,"Anisodactylus sanctaecrucis",None,Iowa,Linn,2018-08-01,"2045-2215. Quit early because of storms.","Wickiup Hill Outdoor Learning Area",42.087352,-91.767107,"Jim Durbin",adult,Blacklight/Fluorescent,Photograph,1,77,52,58,1,180,29.97,cloudy,"95% visible",
232936,,2019-007649,,"Anisodactylus discoideus",None,Iowa,Linn,2019-06-29,2100-2345,"Wickiup Hill Outdoor Learning Area",42.0876,-91.76787,"Jim Durbin",adult,Blacklight/Fluorescent,Photograph,1,85,69,74,0,180,29.84,Clear,"10% visible",
287810,,,,"Anisodactylus discoideus",None,Iowa,Linn,2021-05-24,21:11:36,"Matsell Bridge Natural Area",42.13218947,-91.38528806,"Jim Durbin",adult,Blacklight/Fluorescent,Photograph,1,76,77,68,4,190,30,Cloudy,"full moon",
287811,,,,"Anisodactylus sanctaecrucis",None,Iowa,Linn,2021-05-24,21:11:31,"Matsell Bridge Natural Area",42.13218947,-91.38528806,"Jim Durbin",adult,Blacklight/Fluorescent,Photograph,1,76,77,68,4,190,30,Cloudy,"full moon",
287817,,,,"Anisodactylus sanctaecrucis",None,Iowa,Linn,2021-05-24,21:06:19,"Matsell Bridge Natural Area",42.13218947,-91.38528806,"Jim Durbin",adult,Blacklight/Fluorescent,Photograph,1,76,77,68,4,190,30,Cloudy,"full moon",
287888,,,,"Anisodactylus discoideus",None,Iowa,Linn,2021-05-24,21:11:36,"Matsell Bridge Natural Area",42.13218947,-91.38528806,"Jim Durbin",adult,Blacklight/Fluorescent,Photograph,1,76,77,68,4,190,30,Cloudy,"full moon",
287903,,,,"Anisodactylus sanctaecrucis",None,Iowa,Linn,2021-05-24,22:32:20,"Matsell Bridge Natural Area",42.13218947,-91.38528806,"Jim Durbin",adult,Blacklight/Fluorescent,Photograph,1,76,77,68,4,190,30,Cloudy,"full moon",
290067,,,,"Anisodactylus discoideus",None,Iowa,Linn,2021-07-03,21:46:26,"Pinicon Ridge Park",42.21096962,-91.54429747,"Jim Durbin",adult,Blacklight/Fluorescent,Pinned,1,79,57,63,3,190,29.9,clear,"50% visible",
291713,,,,"Anisodactylus discoideus",None,Iowa,Linn,2021-08-11,22:06:36,"Pleasant Creek State Recreation Area, Linn County",42.11043641,-91.82716239,"Jim Durbin",adult,Blacklight/Fluorescent,Photograph,1,84,66,72,6,270,29.66,"partly cloudy","10% visible",
312890,,,,"Anisodactylus discoideus",None,Iowa,Linn,2022-07-31,21:14:31,"Pinicon Ridge Park",42.21080865,-91.54426907,"Jim Durbin",adult,Sighting,Photograph,1,77,82,71,2,270,29.9,"mostly cloudy","10% visible",
334352,,,,"Anisodactylus discoideus",None,Iowa,Linn,2023-05-23,21:47:56,"Matsell Bridge Natural Area",42.13211034333333,-91.38535067666666,"Jim Durbin",adult,Blacklight/Fluorescent,Photograph,1,,,,0,,,,,
336507,,,,"Anisodactylus sanctaecrucis",None,Iowa,Linn,2023-07-03,21:58:55,"Hitaga Sand Ridge Prairie Preserve",42.250717995,-91.632138603333,"Jim Durbin",adult,Blacklight/Fluorescent,Photograph,1,80,77,72,0,0,29.92,clear,"full moon",
341683,,,,"Anisodactylus discoideus",None,Iowa,Linn,2023-10-01,20:42:08,"Palisades Kepler State Park",41.90828729,-91.50237809,"Jim Durbin",adult,Blacklight/Fluorescent,Photograph,1,81,50,57,11,160,30.15,clear,"50% visible",
367031,,,,"Anisodactylus discoideus",None,Iowa,Linn,2024-06-13,21:29:18,"Palisades Kepler State Park",41.908442985,-91.502353318333,"Jim Durbin",adult,Blacklight/Fluorescent,Photograph,1,79,42,54,6,0,29.88,clear,"40 % visible",
