ID,"Collection / Source","Catalog Number","Specify Number",Taxon,"Common Name",State,County,Date,Time,Locale,Latitude,Longitude,Collector,"Life Stage","Collection Method","Preparation Type",Count,Temperature,Humidity,"Dew Point",Wind,"Wind Direction","Barometric Pressure",Sky,"Moon Phase",Notes
1202,"Jim Durbin Drawer 005",2014-001202,,"Scythris limbella","Chenopodium Scythris Moth",Iowa,Linn,2014-07-26,,"Pleasant Creek State Recreation Area, Linn County",42.109952,-91.822641,"Jim Durbin",adult,Blacklight/Fluorescent,Pinned,1,,,,,,,,,
45841,"Jim Durbin Drawer 005",2014-046218,SPM030089,"Scythris limbella","Chenopodium Scythris Moth",Iowa,Linn,2012-07-12,,"Wanatee County Park",42.0094,-91.56623,"Jim Durbin",adult,Blacklight/Fluorescent,Pinned,1,,,,,,,,,
128326,,2015-018916,,"Scythris limbella","Chenopodium Scythris Moth",Iowa,Linn,2015-07-19,"2100 - 2300","Indian Creek Nature Center",41.968932,-91.586884,"Jim Durbin",adult,Blacklight/Fluorescent,Photograph,1,79,62,64,0,0,29.87,clear,"5 % visible",
168089,,2016-032834,,"Scythris limbella","Chenopodium Scythris Moth",Iowa,Linn,2016-05-31,1030-2300,"Hitaga Sand Ridge Prairie Preserve",42.250957,-91.632098,"Jim Durbin",adult,Blacklight/Florescent,Photograph,1,66,100,65,0,0,29.89,cloudy,"30% visible","1030-2300. Rained for about 45 minutes."
168120,,2016-032865,,"Scythris limbella","Chenopodium Scythris Moth",Iowa,Linn,2016-05-31,1030-2300,"Hitaga Sand Ridge Prairie Preserve",42.250957,-91.632098,"Jim Durbin",adult,Blacklight/Florescent,Photograph,1,66,100,65,0,0,29.89,cloudy,"30% visible","1030-2300. Rained for about 45 minutes."
168144,,2016-032889,,"Scythris limbella","Chenopodium Scythris Moth",Iowa,Linn,2016-05-31,1030-2300,"Hitaga Sand Ridge Prairie Preserve",42.250957,-91.632098,"Jim Durbin",adult,Blacklight/Florescent,Photograph,1,66,100,65,0,0,29.89,cloudy,"30% visible","1030-2300. Rained for about 45 minutes."
173232,,2016-037978,,"Scythris limbella","Chenopodium Scythris Moth",Iowa,Linn,2016-07-30,2100-2330,"Hitaga Sand Ridge Prairie Preserve",42.250957,-91.632098,"Jim Durbin",adult,Blacklight/Fluorescent,Photograph,1,72,87,68,0,0,29.92,"partly cloudy","10% visible",
174698,,2016-039448,,"Scythris limbella","Chenopodium Scythris Moth",Iowa,Linn,2016-08-15,2030-2300,"Hitaga Sand Ridge Prairie Preserve",42.250957,-91.632098,"Jim Durbin",adult,Blacklight/Fluorescent,Photograph,1,75,74,66,0,0,29096,cloudy,full,
196350,,2017-014284,,"Scythris limbella","Chenopodium Scythris Moth",Iowa,Linn,2017-09-14,1945-2230,"Hitaga Sand Ridge Prairie Preserve",42.250957,-91.632098,"Jim Durbin",adult,Blacklight/Fluorescent,Photograph,1,76,68,66,4,145,29.85,cloudy,"40 % visible",
211305,,2018-009462,,"Scythris limbella","Chenopodium Scythris Moth",Iowa,Linn,2018-05-30,"2045 - 2315","Hitaga Sand Ridge Prairie Preserve",42.25095,-91.63209,"Jim Durbin",adult,Blacklight/Fluorescent,Photograph,1,77,56,60,7,270,29.59,"partly cloudy",full,
211963,,2018-010120,,"Scythris limbella","Chenopodium Scythris Moth",Iowa,Linn,2018-06-07,,"Wickiup Hill Outdoor Learning Area",42.087352,-91.767107,"Jim Durbin",adult,Blacklight/Fluorescent,Photograph,1,,,,,,,,,
211995,,2018-010152,,"Scythris limbella","Chenopodium Scythris Moth",Iowa,Linn,2018-06-11,2100-2300,"Hitaga Sand Ridge Prairie Preserve",42.250957,-91.632098,"Jim Durbin",adult,Blacklight/Fluorescent,Photograph,1,68,84,63,7,90,29.89,cloudy,"10% visible",
230282,,2019-004995,,"Scythris limbella","Chenopodium Scythris Moth",Iowa,Linn,2019-05-25,2100-2315,"Hitaga Sand Ridge Prairie Preserve",42.250957,-91.632098,"Jim Durbin",adult,Blacklight/Fluorescent,Photograph,1,75,68,64,1,180,29.82,clear,"80% visible",
230324,,2019-005037,,"Scythris limbella","Chenopodium Scythris Moth",Iowa,Linn,2019-05-25,2100-2315,"Hitaga Sand Ridge Prairie Preserve",42.250957,-91.632098,"Jim Durbin",adult,Blacklight/Fluorescent,Photograph,1,75,68,64,1,180,29.82,clear,"80% visible",
230347,,2019-005060,,"Scythris limbella","Chenopodium Scythris Moth",Iowa,Linn,2019-05-25,2100-2315,"Hitaga Sand Ridge Prairie Preserve",42.250957,-91.632098,"Jim Durbin",adult,Blacklight/Fluorescent,Photograph,1,75,68,64,1,180,29.82,clear,"80% visible",
232588,,2019-007301,,"Scythris limbella","Chenopodium Scythris Moth",Iowa,Linn,2019-06-26,"50% visible","Hitaga Sand Ridge Prairie Preserve",42.250957,-91.632098,"Jim Durbin",adult,Blacklight/Fluorescent,Photograph,1,79,69,68,1,100,29.79,clear,,
232724,,2019-007437,,"Scythris limbella","Chenopodium Scythris Moth",Iowa,Linn,2019-06-26,"50% visible","Hitaga Sand Ridge Prairie Preserve",42.250957,-91.632098,"Jim Durbin",adult,Blacklight/Fluorescent,Photograph,1,79,69,68,1,100,29.79,clear,,
247077,,,,"Scythris limbella","Chenopodium Scythris Moth",Iowa,Linn,2019-06-26,"50% visible","Hitaga Sand Ridge Prairie Preserve",42.250957,-91.632098,"Jim Durbin",adult,Blacklight/Fluorescent,Photograph,1,79,69,68,1,100,29.79,clear,,
247362,,,,"Scythris limbella","Chenopodium Scythris Moth",Iowa,Linn,2019-06-27,19:51:51,"Hitaga Sand Ridge Prairie Preserve",42.250911,-91.632094,"Jim Durbin",adult,Blacklight/Fluorescent,Photograph,1,,,,,,,,,
265436,,,,"Landryia impositella",None,Iowa,Linn,2020-06-05,22:21:10,"Hitaga Sand Ridge Prairie Preserve",42.25088607,-91.63212362,"Jim Durbin",adult,Blacklight/Fluorescent,Photograph,1,75,58,59,4,355,29.95,clear,Full,
265472,,,,"Scythris limbella","Chenopodium Scythris Moth",Iowa,Linn,2020-06-05,22:21:10,"Hitaga Sand Ridge Prairie Preserve",42.25088607,-91.63212362,"Jim Durbin",adult,Blacklight/Fluorescent,Photograph,1,75,58,59,4,355,29.95,clear,Full,
265488,,,,"Landryia impositella",None,Iowa,Linn,2020-06-05,22:21:10,"Hitaga Sand Ridge Prairie Preserve",42.25088607,-91.63212362,"Jim Durbin",adult,Blacklight/Fluorescent,Photograph,1,75,58,59,4,355,29.95,clear,Full,
269829,,,,"Scythris limbella","Chenopodium Scythris Moth",Iowa,Linn,2020-08-08,22:13:42,"Hitaga Sand Ridge Prairie Preserve",42.25088607,-91.63213435,"Jim Durbin",adult,Blacklight/Fluorescent,Photograph,1,78,81,71,7,180,30.02,clear,"80% visible",
270335,,,,"Scythris limbella","Chenopodium Scythris Moth",Iowa,Linn,2020-07-20,21:33:58,"Hitaga Sand Ridge Prairie Preserve",42.25088607,-91.63206998,"Jim Durbin",adult,Blacklight/Fluorescent,Photograph,1,71,75,63,3,110,29.61,clear,new,
291152,,,,"Scythris limbella","Chenopodium Scythris Moth",Iowa,Linn,2021-08-06,22:51:28,"Hitaga Sand Ridge Prairie Preserve",42.25082292,-91.63215158,"Jim Durbin",adult,Blacklight/Fluorescent,Photograph,1,78,72,68,4,165,29.79,cloudy,"new moon",
