ID,"Collection / Source","Catalog Number","Specify Number",Taxon,"Common Name",State,County,Date,Time,Locale,Latitude,Longitude,Collector,"Life Stage","Collection Method","Preparation Type",Count,Temperature,Humidity,"Dew Point",Wind,"Wind Direction","Barometric Pressure",Sky,"Moon Phase",Notes
26894,"Jim Durbin Drawer 011",2014-027242,SPM017566,"Eumarozia malachitana","Sculptured Moth",Iowa,Linn,2010-05-23,,"1460 Douglas Ct, Marion",42.040069,-91.590953,"Jim Durbin",adult,Blacklight/Fluorescent,Pinned,1,,,,,,,,,
26895,"Jim Durbin Drawer 011",2014-027243,SPM017603,"Eumarozia malachitana","Sculptured Moth",Iowa,Linn,2010-05-24,,"Wanatee County Park",42.01026,-91.57381,"Jim Durbin",adult,Blacklight/Fluorescent,Pinned,1,,,,,,,,,
26896,"Jim Durbin Drawer 011",2014-027244,SPM017668,"Eumarozia malachitana","Sculptured Moth",Iowa,Linn,2010-05-26,,"Wanatee County Park",42.01026,-91.57381,"Jim Durbin",adult,Blacklight/Fluorescent,Pinned,1,,,,,,,,,
26897,"Jim Durbin Drawer 011",2014-027245,SPM018021,"Eumarozia malachitana","Sculptured Moth",Iowa,Linn,2010-06-22,,"Wanatee County Park",42.0094,-91.56623,"Jim Durbin",adult,Blacklight/Fluorescent,Pinned,1,,,,,,,,,
26898,"Jim Durbin Drawer 011",2014-027246,SPM018455,"Eumarozia malachitana","Sculptured Moth",Iowa,Linn,2010-07-09,,"Wickiup Hill Outdoor Learning Area",42.08398,-91.7651,"Jim Durbin",adult,Blacklight/Fluorescent,Pinned,1,,,,,,,,,
26900,"Jim Durbin Drawer 011",2014-027248,SPM028452,"Eumarozia malachitana","Sculptured Moth",Iowa,Linn,2012-06-15,,"Matsell Bridge Natural Area",42.13131,-91.38886,"Jim Durbin",adult,Blacklight/Fluorescent,Pinned,1,,,,,,,,,
26902,"Jim Durbin Drawer 011",2014-027250,SPM039696,"Eumarozia malachitana","Sculptured Moth",Iowa,Linn,2014-05-07,,"Matsell Bridge Natural Area",42.13131,-91.38886,"Jim Durbin",adult,Blacklight/Fluorescent,Pinned,1,,,,,,,,,
128350,,2015-018940,,"Eumarozia malachitana","Sculptured Moth",Iowa,Linn,2015-07-19,"2100 - 2300","Indian Creek Nature Center",41.968932,-91.586884,"Jim Durbin",adult,Blacklight/Fluorescent,Photograph,1,79,62,64,0,0,29.87,clear,"5 % visible",
169573,,2016-034318,,"Eumarozia malachitana","Sculptured Moth",Iowa,Linn,2016-06-15,2100-2315,"Hitaga Sand Ridge Prairie Preserve",42.250957,-91.632098,"Jim Durbin",adult,Blacklight/Fluorescent,Photograph,1,83,56,66,8,310,29.74,clear,"90% visible",
210107,"Jim Durbin Drawer 011",2018-008264,,"Eumarozia malachitana","Sculptured Moth",Iowa,Linn,2018-05-09,"2030 to 2300","Hitaga Sand Ridge Prairie Preserve",42.250957,-91.632098,"Jim Durbin",adult,Blacklight/Fluorescent,Pinned,1,66,75,58,6,275,29.78,clear,"50 % visible",
230641,,2019-005875,,"Eumarozia malachitana","Sculptured Moth",Iowa,Linn,2019-05-30,,"Hitaga Sand Ridge Prairie Preserve",42.250957,-91.632098,"Jim Durbin",adult,Blacklight/Fluorescent,Photograph,1,68,81,62,,,29.82,"partly cloidy","10% visible",
230647,,2019-005881,,"Eumarozia malachitana","Sculptured Moth",Iowa,Linn,2019-05-30,,"Hitaga Sand Ridge Prairie Preserve",42.250957,-91.632098,"Jim Durbin",adult,Blacklight/Fluorescent,Photograph,1,68,81,62,,,29.82,"partly cloidy","10% visible",
366289,,,,"Eumarozia malachitana","Sculptured Moth",Iowa,Linn,2024-05-15,21:39:50,"Palisades Kepler State Park",41.908334298333,-91.502515906667,"Jim Durbin",adult,Blacklight/Fluorescent,Photograph,1,70,64,57,3,170,29.83,clear,"40% visible",
367504,,,,"Eumarozia malachitana","Sculptured Moth",Iowa,Linn,2024-06-21,20:47:28,"Palisades Kepler State Park",41.908441376667,-91.502329981667,"Jim Durbin",adult,Blacklight/Fluorescent,Photograph,1,81,70,77,4,180,29.99,"partly cloudy","full moon",
367557,,,,"Eumarozia malachitana","Sculptured Moth",Iowa,Linn,2024-06-21,21:25:03,"Palisades Kepler State Park",41.908421415,-91.502343391667,"Jim Durbin",adult,Blacklight/Fluorescent,Photograph,1,81,70,77,4,180,29.99,"partly cloudy","full moon",
367568,,,,"Eumarozia malachitana","Sculptured Moth",Iowa,Linn,2024-06-21,21:50:26,"Palisades Kepler State Park",41.908441376667,-91.502329981667,"Jim Durbin",adult,Blacklight/Fluorescent,Photograph,1,81,70,77,4,180,29.99,"partly cloudy","full moon",
367595,,,,"Eumarozia malachitana","Sculptured Moth",Iowa,Linn,2024-06-21,21:55:12,"Palisades Kepler State Park",41.908421415,-91.502343391667,"Jim Durbin",adult,Blacklight/Fluorescent,Photograph,1,81,70,77,4,180,29.99,"partly cloudy","full moon",
367833,,,,"Eumarozia malachitana","Sculptured Moth",Iowa,Linn,2024-06-25,20:36:37,"Matsell Bridge Natural Area",42.132206666667,-91.385322201667,"Jim Durbin",adult,Blacklight/Fluorescent,Photograph,1,,,,,,,,,
