ID,"Collection / Source","Catalog Number","Specify Number",Taxon,"Common Name",State,County,Date,Time,Locale,Latitude,Longitude,Collector,"Life Stage","Collection Method","Preparation Type",Count,Temperature,Humidity,"Dew Point",Wind,"Wind Direction","Barometric Pressure",Sky,"Moon Phase",Notes
1264,,2014-001264,,"Elaphria grata","Chalcedony Midget",Iowa,Linn,2014-07-26,,"Pleasant Creek State Recreation Area, Linn County",42.109952,-91.822641,"Jim Durbin",adult,Blacklight/Fluorescent,Photograph,1,,,,,,,,,
24564,"Frank Olsen Drawer 40",2014-024911,SPM007918,"Elaphria grata","Chalcedony Midget",Iowa,Linn,2006-10-08,,"Rock Island Botanical State Preserve",42.02732,-91.72723,"Frank Olsen",adult,,Pinned,1,,,,,,,,,"Located at Iowa State"
24566,"Jim Durbin Drawer 153",2014-024913,SPM009743,"Elaphria grata","Chalcedony Midget",Iowa,Linn,2007-08-25,,"Wanatee County Park",42.0094,-91.56623,"Jim Durbin",adult,Blacklight/Fluorescent,Pinned,1,,,,,,,,,
24570,"Frank Olsen Drawer 40",2014-024917,SPM020561,"Elaphria grata","Chalcedony Midget",Iowa,Linn,2010-10-16,,"Pleasant Creek State Recreation Area, Linn County",42.11952,-91.81215,"Frank Olsen",adult,,Pinned,1,,,,,,,,,"Located at Iowa State"
24587,,2014-024934,SPM026451,"Elaphria grata","Chalcedony Midget",Iowa,Linn,2012-04-25,,"Matsell Bridge Natural Area",42.13131,-91.38886,"Jim Durbin",adult,Blacklight/Fluorescent,Photograph,1,,,,,,,,,
24593,,2014-024940,SPM029980,"Elaphria grata","Chalcedony Midget",Iowa,Linn,2012-07-05,,"Wakpicada Natural Area",42.18892,-91.52035,"Jim Durbin",adult,Blacklight/Fluorescent,Photograph,1,,,,,,,,,
24594,,2014-024941,SPM030364,"Elaphria grata","Chalcedony Midget",Iowa,Linn,2012-07-12,,"Wanatee County Park",42.0094,-91.56623,"Jim Durbin",adult,Blacklight/Fluorescent,Photograph,1,,,,,,,,,
24595,,2014-024942,SPM030380,"Elaphria grata","Chalcedony Midget",Iowa,Linn,2012-07-12,,"Wanatee County Park",42.0094,-91.56623,"Jim Durbin",adult,Blacklight/Fluorescent,Photograph,1,,,,,,,,,
24599,"Frank Olsen Drawer 40",2014-024946,SPM032605,"Elaphria grata","Chalcedony Midget",Iowa,Linn,2012-04-25,,"Wickiup Hill Outdoor Learning Area",42.08398,-91.7651,"Frank Olsen",adult,,Pinned,1,,,,,,,,,"Located at Iowa State"
24606,"Frank Olsen Drawer 40",2014-024953,SPM037372,"Elaphria grata","Chalcedony Midget",Iowa,Linn,2013-09-25,,"Matsell Bridge Natural Area",42.13131,-91.38886,"Frank Olsen",adult,,Pinned,1,,,,,,,,,"Located at Iowa State"
108123,"Frank Olsen Drawer 40",2014-108870,,"Elaphria grata","Chalcedony Midget",Iowa,Linn,2014-09-19,,"Pinicon Ridge Park",42.212678,-91.534628,"Frank Olsen",adult,,Pinned,1,,,,,,,,,"Located at Iowa State"
122694,,2015-013261,,"Elaphria grata","Chalcedony Midget",Iowa,Linn,2015-05-07,,"Matsell Bridge Natural Area",42.131959,-91.388307,"Jim Durbin",adult,Blacklight/Fluorescent,Photograph,1,67,96,65,6,135,29.85,"25% Cloudy","Waning Gibbous",
130416,,2015-021006,,"Elaphria grata","Chalcedony Midget",Iowa,Linn,2015-09-07,"1950 - 2230","Wanatee County Park",42.01026,-91.57381,"Jim Durbin",adult,Blacklight/Fluorescent,Photograph,1,79,79,72,1,120,29.91,"partly cloudy","40% visible",
130691,,2015-021281,,"Elaphria grata","Chalcedony Midget",Iowa,Linn,2015-09-23,"1930 to 2200","Matsell Bridge Natural Area",42.131959,-91.388307,"Jim Durbin",adult,Blacklight/Fluorescent,Photograph,1,72,75,58,0,145,30.13,"partly cloudy","85% visible",
130693,,2015-021283,,"Elaphria grata","Chalcedony Midget",Iowa,Linn,2015-09-23,"1930 to 2200","Matsell Bridge Natural Area",42.131959,-91.388307,"Jim Durbin",adult,Blacklight/Fluorescent,Photograph,1,72,75,58,0,145,30.13,"partly cloudy","85% visible",
130727,,2015-021317,,"Elaphria grata","Chalcedony Midget",Iowa,Linn,2015-09-23,"1930 to 2200","Matsell Bridge Natural Area",42.131959,-91.388307,"Jim Durbin",adult,Blacklight/Fluorescent,Photograph,1,72,75,58,0,145,30.13,"partly cloudy","85% visible",
130765,,2015-021355,,"Elaphria grata","Chalcedony Midget",Iowa,Linn,2015-09-23,"1930 to 2200","Matsell Bridge Natural Area",42.131959,-91.388307,"Jim Durbin",adult,Blacklight/Fluorescent,Photograph,1,72,75,58,0,145,30.13,"partly cloudy","85% visible",
170994,,2016-035739,,"Elaphria grata","Chalcedony Midget",Iowa,Linn,2016-06-27,2100-2330,"Hitaga Sand Ridge Prairie Preserve",42.250957,-91.632098,"Jim Durbin",adult,Blacklight/Fluorescent,Photograph,1,77,59,62,4,300,30.06,"partly cloudy","50% visible",
171227,,2016-035972,,"Elaphria grata","Chalcedony Midget",Iowa,Linn,2016-06-27,2100-2330,"Hitaga Sand Ridge Prairie Preserve",42.250957,-91.632098,"Jim Durbin",adult,Blacklight/Fluorescent,Photograph,1,77,59,62,4,300,30.06,"partly cloudy","50% visible",
171274,,2016-036019,,"Elaphria grata","Chalcedony Midget",Iowa,Linn,2016-06-27,2100-2330,"Hitaga Sand Ridge Prairie Preserve",42.250957,-91.632098,"Jim Durbin",adult,Blacklight/Fluorescent,Photograph,1,77,59,62,4,300,30.06,"partly cloudy","50% visible",
176444,,2016-041194,,"Elaphria grata","Chalcedony Midget",Iowa,Linn,2016-09-11,2000-2200,"Hitaga Sand Ridge Prairie Preserve",42.250957,-91.632098,"Jim Durbin",adult,Blacklight/Fluorescent,Photograph,1,76,40,50,5,120,29.99,clear,"80% visible",
195375,,2017-013339,,"Elaphria grata","Chalcedony Midget",Iowa,Linn,2017-08-14,2030-2300,"Hitaga Sand Ridge Prairie Preserve",42.250957,-91.632098,"Jim Durbin",adult,Blacklight/Fluorescent,Photograph,1,72,97,71,0,0,29.81,clear,"60% visible",
196468,,2017-014402,,"Elaphria grata","Chalcedony Midget",Iowa,Linn,2017-09-14,1945-2230,"Hitaga Sand Ridge Prairie Preserve",42.250957,-91.632098,"Jim Durbin",adult,Blacklight/Fluorescent,Photograph,1,76,68,66,4,145,29.85,cloudy,"40 % visible",
210125,,2018-008282,,"Elaphria grata","Chalcedony Midget",Iowa,Linn,2018-05-09,"2030 to 2300","Hitaga Sand Ridge Prairie Preserve",42.250957,-91.632098,"Jim Durbin",adult,Blacklight/Fluorescent,Photograph,1,66,75,58,6,275,29.78,clear,"50 % visible",
211291,,2018-009448,,"Elaphria grata","Chalcedony Midget",Iowa,Linn,2018-05-30,"2045 - 2315","Hitaga Sand Ridge Prairie Preserve",42.25095,-91.63209,"Jim Durbin",adult,Blacklight/Fluorescent,Photograph,1,77,56,60,7,270,29.59,"partly cloudy",full,
218824,,2018-016980,,"Elaphria grata","Chalcedony Midget",Iowa,Linn,2018-08-16,2030-2330,"Matsell Bridge Natural Area",42.132148,-91.385221,"Jim Durbin",adult,Blacklight/Fluorescent,Photograph,1,72,83,66,5,310,29.84,"partly cloudy","30% visible",
218896,,2018-017052,,"Elaphria grata","Chalcedony Midget",Iowa,Linn,2018-08-16,2030-2330,"Matsell Bridge Natural Area",42.132148,-91.385221,"Jim Durbin",adult,Blacklight/Fluorescent,Photograph,1,72,83,66,5,310,29.84,"partly cloudy","30% visible",
237765,,,,"Elaphria grata","Chalcedony Midget",Iowa,Linn,2019-09-02,,"Matsell Bridge Natural Area",42.131959,-91.388307,"Jim Durbin",adult,Blacklight/Fluorescent,Photograph,1,77,77,67,4,135,29.85,"parthly cloudy","10% visible",
271440,,,,"Elaphria grata","Chalcedony Midget",Iowa,Linn,2020-09-14,21:40:25,"Wickiup Hill Outdoor Learning Area",42.08735192,-91.76707176,"Jim Durbin",adult,Blacklight/Fluorescent,Photograph,1,71,68,60,3,100,29.65,cloudy,"10% visible",
271557,,,,"Elaphria grata","Chalcedony Midget",Iowa,Linn,2020-09-14,21:18:58,"Wickiup Hill Outdoor Learning Area",42.08735192,-91.76707176,"Jim Durbin",adult,Blacklight/Fluorescent,Photograph,1,71,68,60,3,100,29.65,cloudy,"10% visible",
287912,,,,"Elaphria grata","Chalcedony Midget",Iowa,Linn,2021-05-24,22:20:48,"Matsell Bridge Natural Area",42.13218947,-91.38528806,"Jim Durbin",adult,Blacklight/Fluorescent,Photograph,1,76,77,68,4,190,30,Cloudy,"full moon",
291951,,,,"Elaphria grata","Chalcedony Midget",Iowa,Linn,2021-08-15,22:19:46,"Pinicon Ridge Park",42.21087488,-91.54432767,"Jim Durbin",adult,Blacklight/Fluorescent,Photograph,1,72,46,50,3,90,29.96,clear,"50% visible",
308901,"Jim Durbin Drawer 153",2022-000173,,"Elaphria grata","Chalcedony Midget",Iowa,Linn,2012-08-06,,"Rock Island Botanical State Preserve",42.026575,-91.727557,"Frank Olsen",adult,Blacklighting,Pinned,1,,,,,,,,,
309781,,,,"Elaphria grata","Chalcedony Midget",Iowa,Linn,2022-06-03,20:15:21,"Hitaga Sand Ridge Prairie Preserve",42.25096919,-91.63220559,"Jim Durbin",adult,Blacklight/Fluorescent,Photograph,1,66,32,36,0,0,29.96,clear,"10% visible",
312565,,,,"Elaphria grata","Chalcedony Midget",Iowa,Linn,2022-07-26,22:50:58,"Hitaga Sand Ridge Prairie Preserve",42.25103779,-91.63215575,"Jim Durbin",adult,Blacklight/Fluorescent,Photograph,1,76,79,69,1,170,29.91,cloudy,"10% moon",
313789,,,,"Elaphria grata","Chalcedony Midget",Iowa,Linn,2022-08-25,21:52:56,"Hitaga Sand Ridge Prairie Preserve",42.25103416,-91.63218888,"Jim Durbin",adult,Blacklight/Fluorescent,Photograph,1,73,90,70,2,350,30.03,clear,"10% visible",
313814,,,,"Elaphria grata","Chalcedony Midget",Iowa,Linn,2022-08-25,21:42:23,"Hitaga Sand Ridge Prairie Preserve",42.25103416,-91.63218888,"Jim Durbin",adult,Blacklight/Fluorescent,Photograph,1,73,90,70,2,350,30.03,clear,"10% visible",
314534,,,,"Elaphria grata","Chalcedony Midget",Iowa,Linn,2022-09-05,20:36:38,"Pinicon Ridge Park",42.21852221,-91.53890027,"Jim Durbin",adult,Blacklight/Fluorescent,Photograph,1,72,87,68,2,90,30.07,cloudy,"50% visible",
314726,,,,"Elaphria grata","Chalcedony Midget",Iowa,Linn,2022-09-15,21:15:05,"Matsell Bridge Natural Area",42.13206715,-91.38532979,"Jim Durbin",adult,Blacklight/Fluorescent,Photograph,1,80,54,64,3,180,30.05,"partly cloudy","90% visible",
314776,,,,"Elaphria grata","Chalcedony Midget",Iowa,Linn,2022-09-15,20:06:52,"Matsell Bridge Natural Area",42.13206715,-91.38532979,"Jim Durbin",adult,Blacklight/Fluorescent,Photograph,1,80,54,64,3,180,30.05,"partly cloudy","90% visible",
314783,,,,"Elaphria grata","Chalcedony Midget",Iowa,Linn,2022-09-15,20:02:43,"Matsell Bridge Natural Area",42.13206715,-91.38532979,"Jim Durbin",adult,Blacklight/Fluorescent,Photograph,1,80,54,64,3,180,30.05,"partly cloudy","90% visible",
334440,,,,"Elaphria grata","Chalcedony Midget",Iowa,Linn,2023-05-15,21:57:19,"Wanatee County Park",42.01004004666667,-91.56646889666666,"Jim Durbin",adult,Blacklight/Fluorescent,Photograph,1,,,,0,,,,,
341632,,,,"Elaphria grata","Chalcedony Midget",Iowa,Linn,2023-10-01,19:59:02,"Palisades Kepler State Park",41.90828729,-91.50237809,"Jim Durbin",adult,Blacklight/Fluorescent,Photograph,1,81,50,57,11,160,30.15,clear,"50% visible",
366250,,,,"Elaphria grata","Chalcedony Midget",Iowa,Linn,2024-05-15,20:14:39,"Palisades Kepler State Park",41.908334298333,-91.502515906667,"Jim Durbin",adult,Blacklight/Fluorescent,Photograph,1,70,64,57,3,170,29.83,clear,"40% visible",
366258,,,,"Elaphria grata","Chalcedony Midget",Iowa,Linn,2024-05-15,20:18:22,"Palisades Kepler State Park",41.908334298333,-91.502515906667,"Jim Durbin",adult,Blacklight/Fluorescent,Photograph,1,70,64,57,3,170,29.83,clear,"40% visible",
366267,,,,"Elaphria grata","Chalcedony Midget",Iowa,Linn,2024-05-15,20:37:50,"Palisades Kepler State Park",41.908334298333,-91.502515906667,"Jim Durbin",adult,Blacklight/Fluorescent,Photograph,1,70,64,57,3,170,29.83,clear,"40% visible",
366275,,,,"Elaphria grata","Chalcedony Midget",Iowa,Linn,2024-05-15,21:13:09,"Palisades Kepler State Park",41.908334298333,-91.502515906667,"Jim Durbin",adult,Blacklight/Fluorescent,Photograph,1,70,64,57,3,170,29.83,clear,"40% visible",
367516,,,,"Elaphria grata","Chalcedony Midget",Iowa,Linn,2024-06-21,20:56:45,"Palisades Kepler State Park",41.908421415,-91.502343391667,"Jim Durbin",adult,Blacklight/Fluorescent,Photograph,1,81,70,77,4,180,29.99,"partly cloudy","full moon",
367651,,,,"Elaphria grata","Chalcedony Midget",Iowa,Linn,2024-06-21,22:10:09,"Palisades Kepler State Park",41.908421415,-91.502343391667,"Jim Durbin",adult,Blacklight/Fluorescent,Photograph,1,81,70,77,4,180,29.99,"partly cloudy","full moon",
367985,,,,"Elaphria grata","Chalcedony Midget",Iowa,Linn,2024-06-25,21:32:00,"Matsell Bridge Natural Area",42.132206666667,-91.385322201667,"Jim Durbin",adult,Blacklight/Fluorescent,Photograph,1,,,,,,,,,
368052,,,,"Elaphria grata","Chalcedony Midget",Iowa,Linn,2024-06-25,21:57:51,"Matsell Bridge Natural Area",42.132206666667,-91.385322201667,"Jim Durbin",adult,Blacklight/Fluorescent,Photograph,1,,,,,,,,,
