ID,"Collection / Source","Catalog Number","Specify Number",Taxon,"Common Name",State,County,Date,Time,Locale,Latitude,Longitude,Collector,"Life Stage","Collection Method","Preparation Type",Count,Temperature,Humidity,"Dew Point",Wind,"Wind Direction","Barometric Pressure",Sky,"Moon Phase",Notes
25345,"Jim Durbin Drawer 007",2014-025692,SPM026488,"Epermenia imperialella",None,Iowa,Linn,2012-05-02,,"Matsell Bridge Natural Area",42.13131,-91.38886,"Jim Durbin",adult,Blacklight/Fluorescent,Pinned,1,,,,,,,,,
25346,"Jim Durbin Drawer 007",2014-025693,SPM026710,"Epermenia imperialella",None,Iowa,Linn,2012-05-06,,"Matsell Bridge Natural Area",42.13131,-91.38886,"Jim Durbin",adult,Blacklight/Fluorescent,Pinned,1,,,,,,,,,
25347,"Jim Durbin Drawer 007",2014-025694,SPM026727,"Epermenia imperialella",None,Iowa,Linn,2012-05-06,,"Matsell Bridge Natural Area",42.13131,-91.38886,"Jim Durbin",adult,Blacklight/Fluorescent,Pinned,1,,,,,,,,,
25348,,2014-025695,SPM026746,"Epermenia imperialella",None,Iowa,Linn,2012-05-06,,"Matsell Bridge Natural Area",42.13131,-91.38886,"Jim Durbin",adult,Blacklight/Fluorescent,Photograph,1,,,,,,,,,
168771,"Jim Durbin Drawer 007",2016-033516,,"Epermenia imperialella",None,Iowa,Linn,2016-06-05,2045-2300,"Vecny Woods",41.956725,-91.600854,"Jim Durbin",adult,Blacklight/Fluorescent,Pinned,1,80,36,51,4,300,29.67,"partly cloudy","dark phase",
309752,,,,"Epermenia imperialella",None,Iowa,Linn,2022-06-03,20:34:28,"Hitaga Sand Ridge Prairie Preserve",42.25096918,-91.63220559,"Jim Durbin",adult,Blacklight/Fluorescent,Photograph,1,66,32,36,0,0,29.96,clear,"10% visible",
334351,,,,"Epermenia imperialella",None,Iowa,Linn,2023-05-23,21:48:06,"Matsell Bridge Natural Area",42.13211034333334,-91.38535067666668,"Jim Durbin",adult,Blacklight/Fluorescent,Photograph,1,63,59,49,0,30,30.14,"partly cloudy","30% visible",
334619,,,,"Epermenia imperialella",None,Iowa,Linn,2023-05-30,21:50:57,"Hitaga Sand Ridge Prairie Preserve",42.25073718,-91.63212197,"Jim Durbin",adult,Blacklight/Fluorescent,Photograph,1,71,57,55,0,0,29.91,"partly cloudy","90% visible",
