ID,"Collection / Source","Catalog Number","Specify Number",Taxon,"Common Name",State,County,Date,Time,Locale,Latitude,Longitude,Collector,"Life Stage","Collection Method","Preparation Type",Count,Temperature,Humidity,"Dew Point",Wind,"Wind Direction","Barometric Pressure",Sky,"Moon Phase",Notes
230515,,2019-005749,,"Isoperla bilineata",None,Iowa,Linn,2019-05-30,,"Hitaga Sand Ridge Prairie Preserve",42.250957,-91.632098,"Jim Durbin",adult,Blacklight/Fluorescent,Photograph,1,68,81,62,,,29.82,"partly cloidy","10% visible",
265126,,,,"Pteronarcys pictetii","Midwestern Salmonfly",Iowa,Linn,2020-05-27,21:31:32,"Matsell Bridge Natural Area",42.13204088,-91.38537304,"Jim Durbin",adult,Blacklight/Fluorescent,Photograph,1,73,94,72,0,280,29.89,cloudy,"10% visible",
265241,,,,"Pteronarcys pictetii","Midwestern Salmonfly",Iowa,Linn,2020-06-01,21:34:37,"Rehrauer Natural Area",42.2551662,-91.4885161,"Jim Durbin",adult,Blacklight/Fluorescent,Photograph,1,,,,,,,,,
270623,,,,"Perlesta xube",None,Iowa,Linn,2020-06-28,23:16:22,"Wickiup Hill Outdoor Learning Area",42.08735076,-91.76706884,"Jim Durbin",adult,Sighting,Photograph,1,,,,,,,,,
270664,,,,"Neoperla undetermined",None,Iowa,Linn,2020-07-30,21:39:06,"Matsell Bridge Natural Area",42.1321277,-91.38531247,"Jim Durbin",adult,Sighting,Photograph,1,,,,,,,,,
310176,,,,"Isoperla bilineata",None,Iowa,Linn,2022-06-12,20:31:18,"Pinicon Ridge Park",42.21093766,-91.54432936,"Jim Durbin",adult,Sighting,Photograph,1,79,78,70,0,0,29.85,clear,full,
310848,,,,"Neoperla clymene",None,Iowa,Linn,2022-06-24,21:53:03,"Pinicon Ridge Park",42.21090343,-91.54429735,"Jim Durbin",adult,Blacklight/Fluorescent,Photograph,1,75,67,62,8,180,29.96,"partly cloudy","40% moon",
310899,,,,"Neoperla clymene",None,Iowa,Linn,2022-06-24,21:35:22,"Pinicon Ridge Park",42.21090343,-91.54429735,"Jim Durbin",adult,Blacklight/Fluorescent,Photograph,1,75,67,62,8,180,29.96,"partly cloudy","40% moon",
311660,,,,"Neoperla clymene",None,Iowa,Linn,2022-07-02,21:55:52,"Wanatee County Park",42.01013441,-91.56662262,"Jim Durbin",adult,Blacklight/Fluorescent,Photograph,1,72,61,58,3,190,30.02,clear,"10% moon",
311821,,,,"Neoperla clymene",None,Iowa,Linn,2022-07-12,22:43:13,"Matsell Bridge Natural Area",42.13222612,-91.38533046,"Jim Durbin",adult,Sighting,Photograph,1,73,80,67,0,0,29.93,clear,"full moon",
334471,,,,"Isoperla bilineata",None,Iowa,Linn,2023-05-15,21:05:15,"Wanatee County Park",42.01004004666667,-91.56646889666666,"Jim Durbin",adult,Blacklight/Fluorescent,Photograph,1,,,,0,,,,,
336561,,,,"Neoperla clymene",None,Iowa,Linn,2023-07-03,22:10:40,"Hitaga Sand Ridge Prairie Preserve",42.250717995,-91.632138603333,"Jim Durbin",adult,Blacklight/Fluorescent,Photograph,1,80,77,72,0,0,29.92,clear,"full moon",
336592,,,,"Neoperla clymene",None,Iowa,Linn,2023-07-03,22:54:36,"Hitaga Sand Ridge Prairie Preserve",42.250717995,-91.632138603333,"Jim Durbin",adult,Blacklight/Fluorescent,Photograph,1,80,77,72,0,0,29.92,clear,"full moon",
366936,,,,"Neoperla undetermined",None,Iowa,Linn,2024-06-13,20:40:40,"Palisades Kepler State Park",41.908442985,-91.502353318333,"Jim Durbin",adult,Blacklight/Fluorescent,Photograph,1,79,42,54,6,0,29.88,clear,"40 % visible",
366991,,,,"Isoperla bilineata",None,Iowa,Linn,2024-06-13,21:09:24,"Palisades Kepler State Park",41.908442985,-91.502353318333,"Jim Durbin",adult,Blacklight/Fluorescent,Photograph,1,79,42,54,6,0,29.88,clear,"40 % visible",
367115,,,,"Neoperla undetermined",None,Iowa,Linn,2024-06-15,20:44:14,"Hitaga Sand Ridge Prairie Preserve",42.250848798333,-91.632148993333,"Jim Durbin",adult,Blacklight/Fluorescent,Photograph,1,79,50,59,12,170,29.86,"partly cloudy","50% visible",
367146,,,,"Neoperla undetermined",None,Iowa,Linn,2024-06-15,20:54:20,"Hitaga Sand Ridge Prairie Preserve",42.250848798333,-91.632148993333,"Jim Durbin",adult,Blacklight/Fluorescent,Photograph,1,79,50,59,12,170,29.86,"partly cloudy","50% visible",
367459,,,,"Neoperla undetermined",None,Iowa,Linn,2024-06-21,20:27:17,"Palisades Kepler State Park",41.908421415,-91.502343391667,"Jim Durbin",adult,Blacklight/Fluorescent,Photograph,1,81,70,77,4,180,29.99,"partly cloudy","full moon",
367872,,,,"Isoperla undetermined",None,Iowa,Linn,2024-06-25,20:50:26,"Matsell Bridge Natural Area",42.132206666667,-91.385322201667,"Jim Durbin",adult,Blacklight/Fluorescent,Photograph,1,,,,,,,,,
