ID,"Collection / Source","Catalog Number","Specify Number",Taxon,"Common Name",State,County,Date,Time,Locale,Latitude,Longitude,Collector,"Life Stage","Collection Method","Preparation Type",Count,Temperature,Humidity,"Dew Point",Wind,"Wind Direction","Barometric Pressure",Sky,"Moon Phase",Notes
1192,,2014-001192,,"Lygropia rivulalis","Bog Lygropia",Iowa,Linn,2014-07-26,,"Pleasant Creek State Recreation Area, Linn County",42.109952,-91.822641,"Jim Durbin",adult,Blacklight/Fluorescent,Photograph,1,,,,,,,,,
1472,,2014-001472,,"Lygropia rivulalis","Bog Lygropia",Iowa,Linn,2014-07-31,,"Pleasant Creek State Recreation Area, Linn County",42.110327,-91.822988,"Jim Durbin",adult,Blacklight/Fluorescent,Photograph,1,,,,,,,,,
12143,,2014-012425,SPM042212,"Lygropia rivulalis","Bog Lygropia",Iowa,Linn,2014-07-10,,"Pleasant Creek State Recreation Area, Linn County",42.10948,-91.8249,"Jim Durbin",adult,Blacklight/Fluorescent,Photograph,1,,,,,,,,,
12168,,2014-012450,SPM042275,"Lygropia rivulalis","Bog Lygropia",Iowa,Linn,2014-07-10,,"Pleasant Creek State Recreation Area, Linn County",42.10948,-91.8249,"Jim Durbin",adult,Blacklight/Fluorescent,Photograph,1,,,,,,,,,
30474,,2014-030842,SPM042558,"Lygropia rivulalis","Bog Lygropia",Iowa,Linn,2014-07-21,,"Pleasant Creek State Recreation Area, Linn County",42.10948,-91.8249,"Jim Durbin",adult,Blacklight/Fluorescent,Photograph,1,,,,,,,,,
34839,"Jim Durbin Drawer 042",2014-035212,SPM007041,"Lygropia rivulalis","Bog Lygropia",Iowa,Linn,2006-08-01,,"Pleasant Creek State Recreation Area, Linn County",42.11952,-91.81215,"Jim Durbin",adult,Blacklight/Fluorescent,Pinned,1,,,,,,,,,
34840,"Jim Durbin Drawer 042",2014-035213,SPM008987,"Lygropia rivulalis","Bog Lygropia",Iowa,Linn,2007-07-12,,"Pleasant Creek State Recreation Area, Linn County",42.11952,-91.81215,"Jim Durbin",adult,Blacklight/Fluorescent,Pinned,1,,,,,,,,,
34841,"Jim Durbin Drawer 042",2014-035214,SPM008999,"Lygropia rivulalis","Bog Lygropia",Iowa,Linn,2007-07-12,,"Pleasant Creek State Recreation Area, Linn County",42.11952,-91.81215,"Jim Durbin",adult,Blacklight/Fluorescent,Pinned,1,,,,,,,,,
34843,"Jim Durbin Drawer 042",2014-035216,SPM011949,"Lygropia rivulalis","Bog Lygropia",Iowa,Linn,2008-07-30,,Redacted,Redacted,Redacted,"Jim Durbin",adult,Blacklight/Fluorescent,Pinned,1,,,,,,,,,
34847,,2014-035220,SPM016078,"Lygropia rivulalis","Bog Lygropia",Iowa,Linn,2009-07-15,,"Pinicon Ridge Park",42.21188,-91.54753,"Jim Durbin",adult,Blacklight/Fluorescent,Photograph,1,,,,,,,,,
34848,,2014-035221,SPM016079,"Lygropia rivulalis","Bog Lygropia",Iowa,Linn,2009-07-15,,"Pinicon Ridge Park",42.21188,-91.54753,"Jim Durbin",adult,Blacklight/Fluorescent,Photograph,1,,,,,,,,,
34849,"Jim Durbin Drawer 042",2014-035222,SPM018121,"Lygropia rivulalis","Bog Lygropia",Iowa,Linn,2010-06-26,,"Wanatee County Park",42.01026,-91.57381,"Jim Durbin",adult,Blacklight/Fluorescent,Pinned,1,,,,,,,,,
34851,"Jim Durbin Drawer 042",2014-035224,SPM019066,"Lygropia rivulalis","Bog Lygropia",Iowa,Linn,2010-07-17,,"Rock Island Botanical State Preserve",42.02732,-91.72723,"Tom Jantscher",adult,,Pinned,1,,,,,,,,,
34853,"Jim Durbin Drawer 042",2014-035226,SPM022757,"Lygropia rivulalis","Bog Lygropia",Iowa,Linn,2011-07-06,,"Wanatee County Park",42.0094,-91.56623,"Jim Durbin",adult,Blacklight/Fluorescent,Pinned,1,,,,,,,,,
34854,,2014-035227,SPM023095,"Lygropia rivulalis","Bog Lygropia",Iowa,Linn,2011-07-16,,"Wanatee County Park",42.0094,-91.56623,"Jim Durbin",adult,Blacklight/Fluorescent,Photograph,1,,,,,,,,,
34857,,2014-035230,SPM023828,"Lygropia rivulalis","Bog Lygropia",Iowa,Linn,2011-09-02,,"Wanatee County Park",42.0094,-91.56623,"Jim Durbin",adult,Blacklight/Fluorescent,Photograph,1,,,,,,,,,
34858,,2014-035231,SPM023834,"Lygropia rivulalis","Bog Lygropia",Iowa,Linn,2011-09-02,,"Wanatee County Park",42.0094,-91.56623,"Jim Durbin",adult,Blacklight/Fluorescent,Photograph,1,,,,,,,,,
34863,,2014-035236,SPM029406,"Lygropia rivulalis","Bog Lygropia",Iowa,Linn,2012-06-26,,"Wanatee County Park",42.0094,-91.56623,"Jim Durbin",adult,Blacklight/Fluorescent,Photograph,1,,,,,,,,,
34864,,2014-035237,SPM030325,"Lygropia rivulalis","Bog Lygropia",Iowa,Linn,2012-07-12,,"Wanatee County Park",42.0094,-91.56623,"Jim Durbin",adult,Blacklight/Fluorescent,Photograph,1,,,,,,,,,
34866,,2014-035239,SPM031557,"Lygropia rivulalis","Bog Lygropia",Iowa,Linn,2012-06-26,,"Wanatee County Park",42.0094,-91.56623,"Jim Durbin",adult,Blacklight/Fluorescent,Photograph,1,,,,,,,,,
34870,"Frank Olsen Drawer 47",2014-035243,SPM036508,"Lygropia rivulalis","Bog Lygropia",Iowa,Linn,2013-06-25,,"Pinicon Ridge Park",42.21028,-91.54417,"Frank Olsen",adult,,Pinned,1,,,,,,,,,"Located at Iowa State"
34874,,2014-035247,SPM042615,"Lygropia rivulalis","Bog Lygropia",Iowa,Linn,2014-07-21,,"Pleasant Creek State Recreation Area, Linn County",42.10948,-91.8249,"Jim Durbin",adult,Blacklight/Fluorescent,Photograph,1,,,,,,,,,
34875,,2014-035248,SPM042623,"Lygropia rivulalis","Bog Lygropia",Iowa,Linn,2014-07-21,,"Pleasant Creek State Recreation Area, Linn County",42.10948,-91.8249,"Jim Durbin",adult,Blacklight/Fluorescent,Photograph,1,,,,,,,,,
127645,,2015-018235,,"Lygropia rivulalis","Bog Lygropia",Iowa,Linn,2015-06-23,,"Matsell Bridge Natural Area",42.131959,-91.388307,"Jim Durbin",adult,Blacklight/Fluorescent,Photograph,1,,,,,,,,,
127667,,2015-018257,,"Lygropia rivulalis","Bog Lygropia",Iowa,Linn,2015-06-23,,"Matsell Bridge Natural Area",42.131959,-91.388307,"Jim Durbin",adult,Blacklight/Fluorescent,Photograph,1,,,,,,,,,
127674,,2015-018264,,"Lygropia rivulalis","Bog Lygropia",Iowa,Linn,2015-06-23,,"Matsell Bridge Natural Area",42.131959,-91.388307,"Jim Durbin",adult,Blacklight/Fluorescent,Photograph,1,,,,,,,,,
127682,,2015-018272,,"Lygropia rivulalis","Bog Lygropia",Iowa,Linn,2015-06-23,,"Matsell Bridge Natural Area",42.131959,-91.388307,"Jim Durbin",adult,Blacklight/Fluorescent,Photograph,1,,,,,,,,,
128430,,2015-019020,,"Lygropia rivulalis","Bog Lygropia",Iowa,Linn,2015-07-26,"2100 to 2300","Matsell Bridge Natural Area",42.131959,-91.388307,"Jim Durbin",adult,Blacklight/Fluorescent,Photograph,1,75,95,73,2,160,29.92,"partly cloudy","60% visible",
128804,,2015-019394,,"Lygropia rivulalis","Bog Lygropia",Iowa,Linn,2015-07-30,,"Wanatee County Park",42.01026,-91.57381,"Jim Durbin",adult,Blacklight/Fluorescent,Photograph,1,79,68,67,2,270,30.02,clear,"100% visible",
175079,,2016-039829,,"Lygropia rivulalis","Bog Lygropia",Iowa,Linn,2016-08-28,2000-2230,"Hitaga Sand Ridge Prairie Preserve",42.250957,-91.632098,"Jim Durbin",adult,Blacklight/Fluorescent,Photograph,1,74,83,74,9,110,30.1,cloudy,"10% visible","Rained for about 15 minutes at 8:00PM"
195660,,2017-013624,,"Lygropia rivulalis","Bog Lygropia",Iowa,Linn,2017-08-18,2030-2300,"Wickiup Hill Outdoor Learning Area",42.087567,-91.767578,"Jim Durbin",adult,Blacklight/Fluorescent,Photograph,1,71,73,62,5,10,29.88,clear,"20% visible",
196148,,2017-014112,,"Lygropia rivulalis","Bog Lygropia",Iowa,Linn,2017-08-30,2000-2300,"Hitaga Sand Ridge Prairie Preserve",42.250957,-91.632098,"Jim Durbin",adult,Blacklight/Fluorescent,Photograph,1,70,90,68,0,0,30.07,clear,"50% visible",
199988,,2017-017919,,"Lygropia rivulalis","Bog Lygropia",Iowa,Linn,2016-06-21,,"Hitaga Sand Ridge Prairie Preserve",42.250957,-91.632098,"Don F. Becker",adult,,Photograph,1,,,,,,,,,
200024,,2017-017955,,"Lygropia rivulalis","Bog Lygropia",Iowa,Linn,2016-06-21,,"Hitaga Sand Ridge Prairie Preserve",42.250957,-91.632098,"Don F. Becker",adult,,Photograph,1,,,,,,,,,
200353,,2017-018284,,"Lygropia rivulalis","Bog Lygropia",Iowa,Linn,2016-08-28,,"Hitaga Sand Ridge Prairie Preserve",42.250957,-91.632098,"Don F. Becker",adult,,Photograph,1,,,,,,,,,
215560,,2018-013717,,"Lygropia rivulalis","Bog Lygropia",Iowa,Linn,2018-07-18,2100-2300,"Wickiup Hill Outdoor Learning Area",42.087352,-91.767107,"Jim Durbin",adult,Blacklight/Fluorescent,Photograph,1,75,68,64,4,100,29.98,"partly cloudy","15 % visible",
219025,,2018-017181,,"Lygropia rivulalis","Bog Lygropia",Iowa,Linn,2018-08-19,,"Wickiup Hill Outdoor Learning Area",42.087352,-91.767107,"Jim Durbin",adult,Blacklight/Fluorescent,Photograph,1,75,72,65,3,90,29.84,"partly cloudy","50% visible",
219065,,2018-017221,,"Lygropia rivulalis","Bog Lygropia",Iowa,Linn,2018-08-19,,"Wickiup Hill Outdoor Learning Area",42.087352,-91.767107,"Jim Durbin",adult,Blacklight/Fluorescent,Photograph,1,75,72,65,3,90,29.84,"partly cloudy","50% visible",
219479,,2018-017635,,"Lygropia rivulalis","Bog Lygropia",Iowa,Linn,2018-08-25,2015-2300,"Hitaga Sand Ridge Prairie Preserve",42.250604,-91.629962,"Jim Durbin",adult,Blacklight/Fluorescent,Photograph,1,74,97,73,3,310,29.91,cdlear,"Full Moon",
236707,,,,"Lygropia rivulalis","Bog Lygropia",Iowa,Linn,2019-08-19,2030-2300,"Wickiup Hill Outdoor Learning Area",42.087352,-91.767107,"Jim Durbin",adult,Blacklight/Fluorescent,Photograph,1,74,81,68,2,90,29.88,"partly cloudy","90% visible",
237353,,,,"Lygropia rivulalis","Bog Lygropia",Iowa,Linn,2019-08-29,2000-2300,"Vecny Woods",41.956725,-91.600854,"Jim Durbin",adult,Blacklight/Fluorescent,Photograph,1,75,41,50,9,270,29.8,"partly cloudy","0% visible",
237388,,,,"Lygropia rivulalis","Bog Lygropia",Iowa,Linn,2019-08-29,2000-2300,"Vecny Woods",41.956725,-91.600854,"Jim Durbin",adult,Blacklight/Fluorescent,Photograph,1,75,41,50,9,270,29.8,"partly cloudy","0% visible",
237657,,,,"Lygropia rivulalis","Bog Lygropia",Iowa,Linn,2019-08-24,2030-2300,"Hitaga Sand Ridge Prairie Preserve",42.250957,-91.632098,"Jim Durbin",adult,Blacklight/Fluorescent,Photograph,1,65,71,56,2,90,30.01,"partly cloudy","50% visible",
237676,,,,"Lygropia rivulalis","Bog Lygropia",Iowa,Linn,2019-08-24,2030-2300,"Hitaga Sand Ridge Prairie Preserve",42.250957,-91.632098,"Jim Durbin",adult,Blacklight/Fluorescent,Photograph,1,65,71,56,2,90,30.01,"partly cloudy","50% visible",
238055,,,,"Lygropia rivulalis","Bog Lygropia",Iowa,Linn,2019-09-05,"2000 - 2300","Wickiup Hill Outdoor Learning Area",42.087352,-91.767107,"Jim Durbin",adult,Blacklight/Fluorescent,Photograph,1,72,71,62,3,100,29.81,clear,"50% visible",
267565,,,,"Lygropia rivulalis","Bog Lygropia",Iowa,Linn,2020-06-23,22:49:22,"Matsell Bridge Natural Area",42.13215952,-91.38525882,"Jim Durbin",adult,Blacklight/Fluorescent,Photograph,1,64,100,62,3,290,29.9,cloudy,"no moon",
268310,,,,"Lygropia rivulalis","Bog Lygropia",Iowa,Linn,2020-06-30,22:02:17,"Hitaga Sand Ridge Prairie Preserve",42.25088735,-91.63212362,"Jim Durbin",adult,Blacklight/Fluorescent,Photograph,1,78,88,74,2,100,29.85,cloudy,"80% visible",
275001,"Frank Olsen Drawer 47",2020-000752,,"Lygropia rivulalis","Bog Lygropia",Iowa,Linn,2009-07-15,,"Pinicon Ridge Park",42.21188,-91.54753,"Frank Olsen",adult,,Pinned,1,,,,,,,,,"Located at Iowa State"
275002,"Frank Olsen Drawer 47",2020-000753,,"Lygropia rivulalis","Bog Lygropia",Iowa,Linn,2009-07-15,,"Pinicon Ridge Park",42.21188,-91.54753,"Frank Olsen",adult,,Pinned,1,,,,,,,,,"Located at Iowa State"
289322,,,,"Lygropia rivulalis","Bog Lygropia",Iowa,Linn,2021-06-27,23:15:32,"Pleasant Creek State Recreation Area, Linn County",42.1102396,-91.82752613,"Jim Durbin",adult,Sighting,Photograph,1,74,70,64,0,165,29.92,clear,"90% visible",
289975,,,,"Lygropia rivulalis","Bog Lygropia",Iowa,Linn,2021-07-03,22:06:38,"Pinicon Ridge Park",42.21096962,-91.54429747,"Jim Durbin",adult,Blacklight/Fluorescent,Photograph,1,79,57,63,3,190,29.9,clear,"50% visible",
290009,,,,"Lygropia rivulalis","Bog Lygropia",Iowa,Linn,2021-07-03,21:57:30,"Pinicon Ridge Park",42.21096962,-91.54429747,"Jim Durbin",adult,Blacklight/Fluorescent,Photograph,1,79,57,63,3,190,29.9,clear,"50% visible",
290337,,,,"Lygropia rivulalis","Bog Lygropia",Iowa,Linn,2021-07-08,22:35:28,"Hitaga Sand Ridge Prairie Preserve",42.25145774,-91.63021403,"Jim Durbin",adult,Blacklight/Fluorescent,Photograph,1,69,73,60,5,90,29.89,"partly cloudy","5% visible",
310785,,,,"Lygropia rivulalis","Bog Lygropia",Iowa,Linn,2022-06-24,22:15:17,"Pinicon Ridge Park",42.21090343,-91.54429735,"Jim Durbin",adult,Blacklight/Fluorescent,Photograph,1,75,67,62,8,180,29.96,"partly cloudy","40% moon",
310792,,,,"Lygropia rivulalis","Bog Lygropia",Iowa,Linn,2022-06-24,22:11:53,"Pinicon Ridge Park",42.21090343,-91.54429735,"Jim Durbin",adult,Blacklight/Fluorescent,Photograph,1,75,67,62,8,180,29.96,"partly cloudy","40% moon",
310799,,,,"Lygropia rivulalis","Bog Lygropia",Iowa,Linn,2022-06-24,22:10:00,"Pinicon Ridge Park",42.21090343,-91.54429735,"Jim Durbin",adult,Blacklight/Fluorescent,Photograph,1,75,67,62,8,180,29.96,"partly cloudy","40% moon",
311541,,,,"Lygropia rivulalis","Bog Lygropia",Iowa,Linn,2022-07-02,21:07:53,"Wanatee County Park",42.01013441,-91.56662262,"Jim Durbin",adult,Blacklight/Fluorescent,Photograph,1,72,61,58,3,190,30.02,clear,"10% moon",
314494,,,,"Lygropia rivulalis","Bog Lygropia",Iowa,Linn,2022-09-05,21:05:04,"Pinicon Ridge Park",42.21852221,-91.53890027,"Jim Durbin",adult,Blacklight/Fluorescent,Photograph,1,72,87,68,2,90,30.07,cloudy,"50% visible",
314503,,,,"Lygropia rivulalis","Bog Lygropia",Iowa,Linn,2022-09-05,20:58:42,"Pinicon Ridge Park",42.21852221,-91.53890027,"Jim Durbin",adult,Blacklight/Fluorescent,Photograph,1,72,87,68,2,90,30.07,cloudy,"50% visible",
