ID,"Collection / Source","Catalog Number","Specify Number",Taxon,"Common Name",State,County,Date,Time,Locale,Latitude,Longitude,Collector,"Life Stage","Collection Method","Preparation Type",Count,Temperature,Humidity,"Dew Point",Wind,"Wind Direction","Barometric Pressure",Sky,"Moon Phase",Notes
11087,"Jim Durbin Drawer 011",2014-011369,SPM017479,"Apotomis capreana","Sallow Apotomis Moth",Iowa,Linn,2010-05-18,,"Wanatee County Park",42.01026,-91.57381,"Jim Durbin",adult,Blacklight/Fluorescent,Pinned,1,,,,,,,,,
11794,,2014-012076,SPM040825,"Apotomis capreana","Sallow Apotomis Moth",Iowa,Linn,2014-06-17,,"Pleasant Creek State Recreation Area, Linn County",42.10948,-91.8249,"Jim Durbin",adult,Blacklight/Fluorescent,Photograph,1,,,,,,,,,
16201,"Jim Durbin Drawer 011",2014-016499,SPM021484,"Apotomis capreana","Sallow Apotomis Moth",Iowa,Linn,2011-05-30,,"Wanatee County Park",42.0094,-91.56623,"Jim Durbin",adult,Blacklight/Fluorescent,Pinned,1,,,,,,,,,
16202,,2014-016500,SPM039818,"Apotomis capreana","Sallow Apotomis Moth",Iowa,Linn,2014-05-26,,"Wanatee County Park",42.01026,-91.57381,"Jim Durbin",adult,Blacklight/Fluorescent,Photograph,1,,,,,,,,,
16207,"Jim Durbin Drawer 011",2014-016505,SPM026587,"Apotomis capreana","Sallow Apotomis Moth",Iowa,Linn,2012-05-04,,"Wakpicada Natural Area",42.18892,-91.52035,"Jim Durbin",adult,Blacklight/Fluorescent,Pinned,1,,,,,,,,,
21313,"Jim Durbin Drawer 011",2014-021650,SPM022099,"Apotomis capreana","Sallow Apotomis Moth",Iowa,Linn,2011-06-14,,"Wickiup Hill Outdoor Learning Area",42.08398,-91.7651,"Jim Durbin",adult,Blacklight/Fluorescent,Pinned,1,,,,,,,,,
167252,,2016-031997,,"Apotomis capreana","Sallow Apotomis Moth",Iowa,Linn,2016-05-23,2030-2300,"Matsell Bridge Natural Area",42.131126,-91.388999,"Jim Durbin",adult,Blacklight/Florescent,Photograph,1,74,42,50,7,130,29.82,clear,Full,
235741,,,,"Apotomis capreana","Sallow Apotomis Moth",Iowa,Linn,2019-08-11,2030-2300,"Wickiup Hill Outdoor Learning Area",42.087343,-91.767109,"Jim Durbin",adult,Sighting,Photograph,1,75,90,72,4,90,29.81,"parthly cloudy","90% visible",
265249,,,,"Apotomis capreana","Sallow Apotomis Moth",Iowa,Linn,2020-06-01,21:34:37,"Rehrauer Natural Area",42.2551662,-91.4885161,"Jim Durbin",adult,Blacklight/Fluorescent,Photograph,1,,,,,,,,,
287910,,,,"Apotomis capreana","Sallow Apotomis Moth",Iowa,Linn,2021-05-24,22:30:26,"Matsell Bridge Natural Area",42.13218947,-91.38528806,"Jim Durbin",adult,Blacklight/Fluorescent,Photograph,1,76,77,68,4,190,30,Cloudy,"full moon",
367110,,,,"Apotomis capreana","Sallow Apotomis Moth",Iowa,Linn,2024-06-15,20:42:08,"Hitaga Sand Ridge Prairie Preserve",42.250848798333,-91.632148993333,"Jim Durbin",adult,Blacklight/Fluorescent,Photograph,1,79,50,59,12,170,29.86,"partly cloudy","50% visible",
367117,,,,"Apotomis capreana","Sallow Apotomis Moth",Iowa,Linn,2024-06-15,20:44:53,"Hitaga Sand Ridge Prairie Preserve",42.250848798333,-91.632148993333,"Jim Durbin",adult,Blacklight/Fluorescent,Photograph,1,79,50,59,12,170,29.86,"partly cloudy","50% visible",
