ID,"Collection / Source","Catalog Number","Specify Number",Taxon,"Common Name",State,County,Date,Time,Locale,Latitude,Longitude,Collector,"Life Stage","Collection Method","Preparation Type",Count,Temperature,Humidity,"Dew Point",Wind,"Wind Direction","Barometric Pressure",Sky,"Moon Phase",Notes
18728,,2014-019051,SPM033413,"Ataenius platensis",None,Iowa,Linn,2013-04-27,,"Matsell Bridge Natural Area",42.13131,-91.38886,"Jim Durbin",adult,Blacklight/Fluorescent,Photograph,1,,,,,,,,,
211231,,2018-009388,,"Ataenius desertus",None,Iowa,Linn,2018-05-30,"2045 - 2315","Hitaga Sand Ridge Prairie Preserve",42.25095,-91.63209,"Jim Durbin",adult,Blacklight/Fluorescent,Photograph,1,77,56,60,7,270,29.59,"partly cloudy",full,
231905,,2019-006618,,"Ataenius desertus",None,Iowa,Linn,2019-06-17,2100-2300,"Hitaga Sand Ridge Prairie Preserve",42.250957,-91.632098,"Jim Durbin",adult,Blacklight/Fluorescent,Photograph,1,71,68,60,5,110,29.97,cloudy,full,
268775,,,,"Ataenius platensis",None,Iowa,Linn,2020-07-20,2100,"Hitaga Sand Ridge Prairie Preserve",42.250928,-91.63211,"Jim Durbin",adult,Blacklight/Fluorescent,Photograph,1,71,75,63,3,110,29.61,clear,new,
270518,,,,"Ataenius desertus",None,Iowa,Linn,2020-08-08,20:48:47,"Hitaga Sand Ridge Prairie Preserve",42.25088607,-91.63213435,"Jim Durbin",adult,Blacklight/Fluorescent,Photograph,1,78,81,71,7,180,30.02,clear,"80% visible",
295100,,,,"Ataenius platensis",None,Iowa,Linn,2021-08-27,20:23:09,"Hitaga Sand Ridge Prairie Preserve",42.25082009,-91.63219999,"Jim Durbin",adult,Blacklight/Fluorescent,Photograph,1,85,80,78,4,90,29.93,clear,"80% visible",
309941,,,,"Ataenius desertus",None,Iowa,Linn,2022-06-09,20:51:26,"Matsell Bridge Natural Area",42.1322708,-91.38538363,"Jim Durbin",adult,Blacklight/Fluorescent,Photograph,1,68,59,53,0,0,29.95,cloudy,"60% visible",
309975,,,,"Ataenius desertus",None,Iowa,Linn,2022-06-09,20:33:11,"Matsell Bridge Natural Area",42.1322708,-91.38538363,"Jim Durbin",adult,Blacklight/Fluorescent,Photograph,1,68,59,53,0,0,29.95,cloudy,"60% visible",
311076,,,,"Ataenius desertus",None,Iowa,Linn,2022-06-28,22:10:22,"Hitaga Sand Ridge Prairie Preserve",42.25107350333332,-91.63217208666666,"Jim Durbin",adult,Blacklight/Fluorescent,Photograph,1,75,50,56,6,270,30.04,"partly cloudy","new moon",
311649,,,,"Ataenius platensis",None,Iowa,Linn,2022-07-02,20:14:05,"Wanatee County Park",42.01013441,-91.56662262,"Jim Durbin",adult,Blacklight/Fluorescent,Photograph,1,72,61,58,3,190,30.02,clear,"10% moon",
312741,,,,"Ataenius platensis",None,Iowa,Linn,2022-07-26,20:52:58,"Hitaga Sand Ridge Prairie Preserve",42.25103779,-91.63215575,"Jim Durbin",adult,Blacklight/Fluorescent,Photograph,1,76,79,69,1,170,29.91,cloudy,"10% moon",
313209,,,,"Ataenius platensis",None,Iowa,Linn,2022-08-10,20:30:24,"Matsell Bridge Natural Area",42.13198835,-91.38532446,"Jim Durbin",adult,Blacklight/Fluorescent,Photograph,1,68,100,69,0,0,30.15,clear,full,
314575,,,,"Ataenius platensis",None,Iowa,Linn,2022-09-05,20:01:24,"Pinicon Ridge Park",42.21852221,-91.53890027,"Jim Durbin",adult,Blacklight/Fluorescent,Photograph,1,72,87,68,2,90,30.07,cloudy,"50% visible",
336242,,,,"Ataenius platensis",None,Iowa,Linn,2023-06-29,21:28:51,"Indian Creek Nature Center",41.96608977,-91.58982624,"Jim Durbin",adult,Blacklight/Fluorescent,Photograph,1,76,92,74,0,330,29.88,hazy,"50% visible",
337986,,,,"Ataenius desertus",None,Iowa,Linn,2023-07-16,22:59:30,"Matsell Bridge Natural Area",42.13217249,-91.38522877,"Jim Durbin",adult,Blacklight/Fluorescent,Photograph,1,73,70,63,4,220,29.87,cloudy,"10% visible",
339102,,,,"Ataenius platensis",None,Iowa,Linn,2023-08-02,20:53:28,"Wanatee County Park",42.00997111,-91.5665254,"Jim Durbin",adult,Blacklight/Fluorescent,Photograph,1,75,94,73,3,110,30,"partly cloudy",full,
341483,,,,"Ataenius desertus",None,Iowa,Linn,2023-09-08,20:09:36,"Pinicon Ridge Park",42.21893755,-91.53818983,"Jim Durbin",adult,Blacklight/Fluorescent,Photograph,1,74,41,49,7,15,30.09,clear,,
366242,,,,"Ataenius platensis",None,Iowa,Linn,2024-05-15,19:59:15,"Palisades Kepler State Park",41.908334298333,-91.502515906667,"Jim Durbin",adult,Blacklight/Fluorescent,Photograph,1,70,64,57,3,170,29.83,clear,"40% visible",
367455,,,,"Ataenius platensis",None,Iowa,Linn,2024-06-21,20:21:46,"Palisades Kepler State Park",41.908421415,-91.502343391667,"Jim Durbin",adult,Blacklight/Fluorescent,Photograph,1,81,70,77,4,180,29.99,"partly cloudy","full moon",
