ID,"Collection / Source","Catalog Number","Specify Number",Taxon,"Common Name",State,County,Date,Time,Locale,Latitude,Longitude,Collector,"Life Stage","Collection Method","Preparation Type",Count,Temperature,Humidity,"Dew Point",Wind,"Wind Direction","Barometric Pressure",Sky,"Moon Phase",Notes
1,"Jim Durbin Drawer 120",2014-000001,,"Scoliopteryx libatrix","The Herald Moth",Iowa,Linn,2014-07-26,,"Pleasant Creek State Recreation Area, Linn County",42.111467,-91.824179,"Jim Durbin",adult,Blacklight/Fluorescent,Pinned,1,,,,,,,,,
4,,2014-000004,SPM000101,"Haploa reversa","Reversed Hapola Moth",Iowa,Linn,2003-07-26,,"Wanatee County Park",42.0094,-91.56623,"Jim Durbin",adult,Blacklight/Fluorescent,Sighting,1,,,,,,,,,
81,"Frank Olsen Drawer 52",2014-000081,SPM010437,"Hypoprepia miniata","Scarlet-Winged Lichen Moth",Iowa,Linn,2007-07-12,,"Pleasant Creek State Recreation Area, Linn County",42.11952,-91.81215,"Frank Olsen",adult,,Pinned,1,,,,,,,,,"Located at Iowa State"
82,"Jim Durbin Drawer 133",2014-000082,SPM001013,"Catocala coccinata","Scarlet Underwing",Iowa,Linn,2004-07-23,,Redacted,Redacted,Redacted,"Jim Durbin",adult,Blacklight/Fluorescent,Pinned,1,,,,,,,,,
89,"Frank Olsen Drawer 51",2014-000089,SPM010444,"Pyrrharctia isabella","Isabella Tiger Moth",Iowa,Linn,2007-05-18,,"Pinicon Ridge Park",42.21188,-91.54753,"Frank Olsen",adult,,Pinned,1,,,,,,,,,"Located at Iowa State"
90,"Frank Olsen Drawer 51",2014-000090,SPM010445,"Pyrrharctia isabella","Isabella Tiger Moth",Iowa,Linn,2007-08-03,,"Pinicon Ridge Park",42.21188,-91.54753,"Frank Olsen",adult,,Pinned,1,,,,,,,,,"Located at Iowa State"
93,"Jim Durbin Drawer 134",2014-000093,SPM001014,"Catocala amica-lineella","Girlfriend Underwing",Iowa,Linn,2004-07-23,,Redacted,Redacted,Redacted,"Jim Durbin",adult,Blacklight/Fluorescent,Pinned,1,,,,,,,,,
94,"Frank Olsen Drawer 51",2014-000094,SPM010448,"Spilosoma congrua","Agreeable Tiger Moth",Iowa,Linn,2007-05-07,,"Rock Island Botanical State Preserve",42.02732,-91.72723,"Frank Olsen",adult,,Pinned,1,,,,,,,,,"Located at Iowa State"
95,"Frank Olsen Drawer 56",2014-000095,SPM010449,"Spilosoma virginica","Virginian Tiger Moth",Iowa,Linn,2007-07-07,,"Pinicon Ridge Park",42.21188,-91.54753,"Frank Olsen",adult,,Pinned,1,,,,,,,,,"Located at Iowa State"
96,"Frank Olsen Drawer 56",2014-000096,SPM010450,"Hyphantria cunea","Fall Webworm Moth",Iowa,Linn,2007-05-18,,"Pinicon Ridge Park",42.21188,-91.54753,"Frank Olsen",adult,,Pinned,1,,,,,,,,,"Located at Iowa State"
99,"Frank Olsen Drawer 55",2014-000099,SPM010453,"Ctenucha virginica","Virginia Ctenucha Moth",Iowa,Linn,2007-06-11,,"Rock Island Botanical State Preserve",42.02732,-91.72723,"Frank Olsen",adult,,Pinned,1,,,,,,,,,"Located at Iowa State"
101,"Frank Olsen Drawer 59",2014-000101,SPM010455,"Plusiodonta compressipalpis","Moonseed Moth",Iowa,Linn,2007-07-12,,"Pleasant Creek State Recreation Area, Linn County",42.11952,-91.81215,"Frank Olsen",adult,,Pinned,1,,,,,,,,,"Located at Iowa State"
115,,2014-000115,SPM000102,"Haploa reversa","Reversed Hapola Moth",Iowa,Linn,2003-07-26,,"Wanatee County Park",42.0094,-91.56623,"Jim Durbin",adult,Blacklight/Fluorescent,Sighting,1,,,,,,,,,
127,"Jim Durbin Drawer 110",2014-000127,SPM001017,"Apantesis virgo","Virgin Tiger Moth",Iowa,Linn,2004-07-23,,Redacted,Redacted,Redacted,"Jim Durbin",adult,Blacklight/Fluorescent,Pinned,1,,,,,,,,,
138,"Jim Durbin Drawer 117",2014-000138,SPM001018,"Hypena edictalis","Large Hypena Moth",Iowa,Linn,2004-07-23,,Redacted,Redacted,Redacted,"Jim Durbin",adult,Blacklight/Fluorescent,Pinned,1,,,,,,,,,
149,"Jim Durbin Drawer 103",2014-000149,SPM001019,"Hypoprepia fucosa","Painted Lichen Moth",Iowa,Linn,2004-07-23,,Redacted,Redacted,Redacted,"Jim Durbin",adult,Blacklight/Fluorescent,Pinned,1,,,,,,,,,
182,"Jim Durbin Drawer 133",2014-000182,SPM001022,"Catocala coccinata","Scarlet Underwing",Iowa,Linn,2004-07-17,,"Wanatee County Park",42.0094,-91.56623,"Jim Durbin",adult,Blacklight/Fluorescent,Pinned,1,,,,,,,,,
186,"Frank Olsen Drawer 50",2014-000186,SPM010531,"Hypena baltimoralis","Baltimore Bomolocha Moth",Iowa,Linn,2007-08-03,,"Pinicon Ridge Park",42.21188,-91.54753,"Frank Olsen",adult,,Pinned,1,,,,,,,,,"Located at Iowa State"
187,"Frank Olsen Drawer 50",2014-000187,SPM010532,"Hypena bijugalis","Dimorphic Bomolocha Moth",Iowa,Linn,2007-05-07,,"Rock Island Botanical State Preserve",42.02732,-91.72723,"Frank Olsen",adult,,Pinned,1,,,,,,,,,"Located at Iowa State"
189,"Frank Olsen Drawer 58",2014-000189,SPM010534,"Hypena scabra","Green Cloverworm Moth",Iowa,Linn,2007-08-27,,"Wanatee County Park",42.00994,-91.57749,"Frank Olsen",adult,,Pinned,1,,,,,,,,,"Located at Iowa State"
190,"Frank Olsen Drawer 58",2014-000190,SPM010535,"Hypena scabra","Green Cloverworm Moth",Iowa,Linn,2007-09-16,,"Pinicon Ridge Park",42.21188,-91.54753,"Frank Olsen",adult,,Pinned,1,,,,,,,,,"Located at Iowa State"
191,"Frank Olsen Drawer 59",2014-000191,SPM010536,"Scolecocampa liburna","Dead-wood Borer Moth",Iowa,Linn,2007-07-08,,"J. Harold Ennis County Park",41.898488,-91.483092,"Frank Olsen",adult,,Pinned,1,,,,,,,,,"Located at Iowa State"
192,"Frank Olsen Drawer 59",2014-000192,SPM010537,"Scolecocampa liburna","Dead-wood Borer Moth",Iowa,Linn,2007-07-12,,"Pleasant Creek State Recreation Area, Linn County",42.11952,-91.81215,"Frank Olsen",adult,,Pinned,1,,,,,,,,,"Located at Iowa State"
193,"Jim Durbin Drawer 134",2014-000193,SPM001023,"Catocala ultronia","Ultronia Underwing",Iowa,Linn,2004-07-17,,"Wanatee County Park",42.0094,-91.56623,"Jim Durbin",adult,Blacklight/Fluorescent,Pinned,1,,,,,,,,,
201,,2014-000201,SPM010545,"Cissusa spadix","Black-dotted Brown Moth",Iowa,Linn,2007-03-26,,"J. Harold Ennis County Park",41.898488,-91.483092,"Frank Olsen",adult,,Pinned,1,,,,,,,,,"to verify"
202,"Frank Olsen Drawer 39",2014-000202,SPM010546,"Caenurgina erechtea","Forage Looper Moth",Iowa,Linn,2007-09-29,,"J. Harold Ennis County Park",41.898488,-91.483092,"Frank Olsen",adult,,Pinned,1,,,,,,,,,"Located at Iowa State"
203,"Frank Olsen Drawer 39",2014-000203,SPM010547,"Caenurgina erechtea","Forage Looper Moth",Iowa,Linn,2007-08-21,,"Pinicon Ridge Park",42.21188,-91.54753,"Frank Olsen",adult,,Pinned,1,,,,,,,,,"Located at Iowa State"
206,"Frank Olsen Drawer 39",2014-000206,SPM010549,"Mocis latipes","Small Mocis",Iowa,Linn,2007-10-03,,"Pleasant Creek State Recreation Area, Linn County",42.11952,-91.81215,"Frank Olsen",adult,,Pinned,1,,,,,,,,,"Located at Iowa State"
207,,2014-000207,SPM010550,"Mocis latipes","Small Mocis",Iowa,Linn,2007-08-08,,"Pinicon Ridge Park",42.21188,-91.54753,"Frank Olsen",adult,,Pinned,1,,,,,,,,,"to verify"
226,,2014-000226,SPM000103,"Haploa reversa","Reversed Hapola Moth",Iowa,Linn,2003-07-26,,"Wanatee County Park",42.0094,-91.56623,"Jim Durbin",adult,Blacklight/Fluorescent,Sighting,1,,,,,,,,,
330,"Frank Olsen Drawer 43",2014-000330,SPM010662,"Clemensia albata","Little White Lichen Moth",Iowa,Linn,2007-08-21,,"Pinicon Ridge Park",42.21188,-91.54753,"Frank Olsen",adult,,Pinned,1,,,,,,,,,"Located at Iowa State"
331,"Frank Olsen Drawer 42",2014-000331,SPM010663,"Idia americalis","American Idia Moth",Iowa,Linn,2007-09-16,,"Pinicon Ridge Park",42.21188,-91.54753,"Frank Olsen",adult,,Pinned,1,,,,,,,,,"Located at Iowa State"
332,"Frank Olsen Drawer 42",2014-000332,SPM010664,"Idia americalis","American Idia Moth",Iowa,Linn,2007-08-21,,"Pinicon Ridge Park",42.21188,-91.54753,"Frank Olsen",adult,,Pinned,1,,,,,,,,,"Located at Iowa State"
333,"Frank Olsen Drawer 42",2014-000333,SPM010665,"Idia americalis","American Idia Moth",Iowa,Linn,2007-05-18,,"Pinicon Ridge Park",42.21188,-91.54753,"Frank Olsen",adult,,Pinned,1,,,,,,,,,"Located at Iowa State"
334,"Frank Olsen Drawer 42",2014-000334,SPM010666,"Idia americalis","American Idia Moth",Iowa,Linn,2007-07-12,,"Pleasant Creek State Recreation Area, Linn County",42.11952,-91.81215,"Frank Olsen",adult,,Pinned,1,,,,,,,,,"Located at Iowa State"
335,"Frank Olsen Drawer 42",2014-000335,SPM010667,"Idia americalis","American Idia Moth",Iowa,Linn,2007-10-04,,"Rock Island Botanical State Preserve",42.02732,-91.72723,"Frank Olsen",adult,,Pinned,1,,,,,,,,,"Located at Iowa State"
337,,2014-000337,SPM000104,"Virbia aurantiaca","Orange Holomelina Moth",Iowa,Linn,2003-08-29,,"Behren's Pond Woodland State Preserve",42.118214,-91.754324,"Jim Durbin",adult,Blacklight/Fluorescent,Sighting,1,,,,,,,,,
339,"Frank Olsen Drawer 42",2014-000339,SPM010669,"Idia aemula","Common Idia Moth",Iowa,Linn,2007-09-05,,"Pleasant Creek State Recreation Area, Linn County",42.11952,-91.81215,"Frank Olsen",adult,,Pinned,1,,,,,,,,,"Located at Iowa State"
340,"Frank Olsen Drawer 42",2014-000340,SPM010670,"Idia aemula","Common Idia Moth",Iowa,Linn,2007-08-21,,"Pinicon Ridge Park",42.21188,-91.54753,"Frank Olsen",adult,,Pinned,1,,,,,,,,,"Located at Iowa State"
341,"Frank Olsen Drawer 42",2014-000341,SPM010671,"Idia aemula","Common Idia Moth",Iowa,Linn,2007-09-16,,"Pinicon Ridge Park",42.21188,-91.54753,"Frank Olsen",adult,,Pinned,1,,,,,,,,,"Located at Iowa State"
343,"Frank Olsen Drawer 42",2014-000343,SPM010673,"Idia aemula","Common Idia Moth",Iowa,Linn,2007-09-29,,"J. Harold Ennis County Park",41.898488,-91.483092,"Frank Olsen",adult,,Pinned,1,,,,,,,,,"Located at Iowa State"
345,"Frank Olsen Drawer 42",2014-000345,SPM010675,"Tetanolita floridana","Florida Tetanolita Moth",Iowa,Linn,2007-09-29,,"J. Harold Ennis County Park",41.898488,-91.483092,"Frank Olsen",adult,,Pinned,1,,,,,,,,,"Located at Iowa State"
346,"Frank Olsen Drawer 42",2014-000346,SPM010676,"Tetanolita floridana","Florida Tetanolita Moth",Iowa,Linn,2007-09-29,,"J. Harold Ennis County Park",41.898488,-91.483092,"Frank Olsen",adult,,Pinned,1,,,,,,,,,"Located at Iowa State"
347,"Frank Olsen Drawer 42",2014-000347,SPM010677,"Lascoria ambigualis","Ambiguous Moth",Iowa,Linn,2007-08-27,,"Wanatee County Park",42.00994,-91.57749,"Frank Olsen",adult,,Pinned,1,,,,,,,,,"Located at Iowa State"
350,"Frank Olsen Drawer 42",2014-000350,SPM010679,"Palthis asopialis","Faint-spotted Palthis Moth",Iowa,Linn,2007-09-29,,"J. Harold Ennis County Park",41.898488,-91.483092,"Frank Olsen",adult,,Pinned,1,,,,,,,,,"Located at Iowa State"
393,"Jim Durbin Drawer 127",2014-000393,SPM001042,"Catocala retecta","The Yellow-Gray Underwing",Iowa,Linn,2003-07-18,,"Behren's Pond Woodland State Preserve",42.118214,-91.754324,"Jim Durbin",adult,Blacklight/Fluorescent,Pinned,1,,,,,,,,,*
404,"Jim Durbin Drawer 132",2014-000404,SPM001043,"Catocala unijuga","Once-married Underwing",Iowa,Linn,2003-07-18,,"Behren's Pond Woodland State Preserve",42.118214,-91.754324,"Jim Durbin",adult,Blacklight/Fluorescent,Pinned,1,,,,,,,,,
415,"Jim Durbin Drawer 123",2014-000415,SPM001044,"Zale lunata","Lunate Zale Moth",Iowa,Linn,2004-08-06,,"Wanatee County Park",42.0094,-91.56623,"Jim Durbin",adult,Blacklight/Fluorescent,Pinned,1,,,,,,,,,
425,"Frank Olsen Drawer 50",2014-000425,SPM010753,"Orgyia leucostigma","White-marked Tussock Moth",Iowa,Linn,2007-09-16,,"Pinicon Ridge Park",42.21188,-91.54753,"Frank Olsen",adult,,Pinned,1,,,,,,,,,"Located at Iowa State"
426,"Jim Durbin Drawer 105",2014-000426,SPM001045,"Spilosoma congrua","Agreeable Tiger Moth",Iowa,Linn,2004-08-06,,"Wanatee County Park",42.0094,-91.56623,"Jim Durbin",adult,Blacklight/Fluorescent,Pinned,1,,,,,,,,,
427,"Frank Olsen Drawer 50",2014-000427,SPM010754,"Orgyia leucostigma","White-marked Tussock Moth",Iowa,Linn,2007-09-16,,"Pinicon Ridge Park",42.21188,-91.54753,"Frank Olsen",adult,,Pinned,1,,,,,,,,,"Located at Iowa State"
428,"Frank Olsen Drawer 50",2014-000428,SPM010755,"Orgyia leucostigma","White-marked Tussock Moth",Iowa,Linn,2007-09-16,,"Pinicon Ridge Park",42.21188,-91.54753,"Frank Olsen",adult,,Pinned,1,,,,,,,,,"Located at Iowa State"
429,,2014-000429,SPM010756,"Orgyia leucostigma","White-marked Tussock Moth",Iowa,Linn,2007-09-16,,"Pinicon Ridge Park",42.21188,-91.54753,"Frank Olsen",adult,,Pinned,1,,,,,,,,,"to verify"
430,"Frank Olsen Drawer 50",2014-000430,SPM010757,"Idia lubricalis","Glossy Black Idia Moth",Iowa,Linn,2007-07-26,,"J. Harold Ennis County Park",41.898488,-91.483092,"Frank Olsen",adult,,Pinned,1,,,,,,,,,"Located at Iowa State"
431,"Frank Olsen Drawer 50",2014-000431,SPM010758,"Idia lubricalis","Glossy Black Idia Moth",Iowa,Linn,2007-07-23,,"Rock Island Botanical State Preserve",42.02732,-91.72723,"Frank Olsen",adult,,Pinned,1,,,,,,,,,"Located at Iowa State"
432,"Frank Olsen Drawer 50",2014-000432,SPM010759,"Zanclognatha pedipilalis","Grayish Zanclognatha Moth",Iowa,Linn,2007-05-18,,"Pinicon Ridge Park",42.21188,-91.54753,"Frank Olsen",adult,,Pinned,1,,,,,,,,,"Located at Iowa State"
433,"Frank Olsen Drawer 50",2014-000433,SPM010760,"Zanclognatha marcidilinea","Yellowish Zanclognatha Moth",Iowa,Linn,2007-07-23,,"Rock Island Botanical State Preserve",42.02732,-91.72723,"Frank Olsen",adult,,Pinned,1,,,,,,,,,"Located at Iowa State"
434,"Frank Olsen Drawer 58",2014-000434,SPM010761,"Hypena sordidula","Sordid Bomolocha Moth",Iowa,Linn,2007-05-10,,"J. Harold Ennis County Park",41.898488,-91.483092,"Frank Olsen",adult,,Pinned,1,,,,,,,,,"Located at Iowa State"
435,"Frank Olsen Drawer 50",2014-000435,SPM010762,"Hypena bijugalis","Dimorphic Bomolocha Moth",Iowa,Linn,2007-05-18,,"Pinicon Ridge Park",42.21188,-91.54753,"Frank Olsen",adult,,Pinned,1,,,,,,,,,"Located at Iowa State"
436,"Frank Olsen Drawer 58",2014-000436,SPM010763,"Hypena deceptalis","Deceptive Bomolocha Moth",Iowa,Linn,2007-08-03,,"Pinicon Ridge Park",42.21188,-91.54753,"Frank Olsen",adult,,Pinned,1,,,,,,,,,"Located at Iowa State"
438,"Frank Olsen Drawer 59",2014-000438,SPM010764,"Isogona tenuis","Thin-lined Owlet Moth",Iowa,Linn,2007-07-12,,"Pleasant Creek State Recreation Area, Linn County",42.11952,-91.81215,"Frank Olsen",adult,,Pinned,1,,,,,,,,,"Located at Iowa State"
439,"Frank Olsen Drawer 68",2014-000439,SPM010765,"Zale minerea","Colorful Zale Moth",Iowa,Linn,2007-04-29,,"Pleasant Creek State Recreation Area, Linn County",42.11952,-91.81215,"Frank Olsen",adult,,Pinned,1,,,,,,,,,"Located at Iowa State"
448,,2014-000448,SPM000105,"Virbia aurantiaca","Orange Holomelina Moth",Iowa,Linn,2003-07-23,,"Wanatee County Park",42.0094,-91.56623,"Jim Durbin",adult,Blacklight/Fluorescent,Sighting,1,,,,,,,,,
517,"Jim Durbin Drawer 112",2014-000517,SPM010897,"Idia aemula","Common Idia Moth",Iowa,Linn,2008-07-01,,"1460 Douglas Ct, Marion",42.040069,-91.590953,"Jim Durbin",adult,Blacklight/Fluorescent,Pinned,1,,,,,,,,,
529,"Jim Durbin Drawer 110",2014-000529,SPM010908,"Halysidota tessellaris-harrisii",None,Iowa,Linn,2008-07-01,,"1460 Douglas Ct, Marion",42.040069,-91.590953,"Jim Durbin",adult,Blacklight/Fluorescent,Pinned,1,,,,,,,,,
533,"Jim Durbin Drawer 112",2014-000533,SPM010912,"Idia americalis","American Idia Moth",Iowa,Linn,2008-07-01,,"1460 Douglas Ct, Marion",42.040069,-91.590953,"Jim Durbin",adult,Blacklight/Fluorescent,Pinned,1,,,,,,,,,
534,"Jim Durbin Drawer 112",2014-000534,SPM010913,"Idia americalis","American Idia Moth",Iowa,Linn,2008-07-01,,"1460 Douglas Ct, Marion",42.040069,-91.590953,"Jim Durbin",adult,Blacklight/Fluorescent,Pinned,1,,,,,,,,,
541,"Jim Durbin Drawer 112",2014-000541,SPM010919,"Idia aemula","Common Idia Moth",Iowa,Linn,2008-07-01,,"1460 Douglas Ct, Marion",42.040069,-91.590953,"Jim Durbin",adult,Blacklight/Fluorescent,Pinned,1,,,,,,,,,
542,"Jim Durbin Drawer 112",2014-000542,SPM010920,"Idia americalis","American Idia Moth",Iowa,Linn,2008-07-01,,"1460 Douglas Ct, Marion",42.040069,-91.590953,"Jim Durbin",adult,Blacklight/Fluorescent,Pinned,1,,,,,,,,,
545,"Jim Durbin Drawer 112",2014-000545,SPM010923,"Idia americalis","American Idia Moth",Iowa,Linn,2008-07-01,,"1460 Douglas Ct, Marion",42.040069,-91.590953,"Jim Durbin",adult,Blacklight/Fluorescent,Pinned,1,,,,,,,,,
559,,2014-000559,SPM000106,"Virbia laeta","Joyful Holomelina Moth",Iowa,Linn,2003-08-29,,"Behren's Pond Woodland State Preserve",42.118214,-91.754324,"Jim Durbin",adult,Blacklight/Fluorescent,Sighting,1,,,,,,,,,
576,"Frank Olsen Drawer 59",2014-000576,SPM010950,"Plusiodonta compressipalpis","Moonseed Moth",Iowa,Linn,2004-05-19,,"Wickiup Hill Outdoor Learning Area",42.08398,-91.7651,"Frank Olsen",adult,,Pinned,1,,,,,,,,,"Located at Iowa State"
604,"Jim Durbin Drawer 110",2014-000604,SPM001061,"Apantesis arge","Arge Tiger Moth",Iowa,Linn,2004-09-04,,"Wickiup Hill Outdoor Learning Area",42.08398,-91.7651,"Jim Durbin",adult,Blacklight/Fluorescent,Pinned,1,,,,,,,,,
615,"Jim Durbin Drawer 123",2014-000615,SPM001062,"Zale lunata","Lunate Zale Moth",Iowa,Linn,2004-09-04,,"Wickiup Hill Outdoor Learning Area",42.08398,-91.7651,"Jim Durbin",adult,Blacklight/Fluorescent,Pinned,1,,,,,,,,,
643,"Jim Durbin Drawer 112",2014-000643,SPM011011,"Idia americalis","American Idia Moth",Iowa,Linn,2008-07-13,,"1460 Douglas Ct, Marion",42.040069,-91.590953,"Jim Durbin",adult,Blacklight/Fluorescent,Pinned,1,,,,,,,,,
644,"Jim Durbin Drawer 112",2014-000644,SPM011012,"Idia americalis","American Idia Moth",Iowa,Linn,2008-07-13,,"1460 Douglas Ct, Marion",42.040069,-91.590953,"Jim Durbin",adult,Blacklight/Fluorescent,Pinned,1,,,,,,,,,
645,"Jim Durbin Drawer 113",2014-000645,SPM011013,"Chytolita morbidalis","Morbid Owlet Moth",Iowa,Linn,2008-07-13,,"1460 Douglas Ct, Marion",42.040069,-91.590953,"Jim Durbin",adult,Blacklight/Fluorescent,Pinned,1,,,,,,,,,
647,"Jim Durbin Drawer 103",2014-000647,SPM011015,"Hypoprepia fucosa","Painted Lichen Moth",Iowa,Linn,2008-07-13,,"1460 Douglas Ct, Marion",42.040069,-91.590953,"Jim Durbin",adult,Blacklight/Fluorescent,Pinned,1,,,,,,,,,
649,"Jim Durbin Drawer 103",2014-000649,SPM011016,"Hypoprepia fucosa","Painted Lichen Moth",Iowa,Linn,2008-07-13,,"1460 Douglas Ct, Marion",42.040069,-91.590953,"Jim Durbin",adult,Blacklight/Fluorescent,Pinned,1,,,,,,,,,
668,"Jim Durbin Drawer 111",2014-000668,SPM013202,"Ctenucha virginica","Virginia Ctenucha Moth",Iowa,Linn,2002-06-06,,"Matsell Bridge Natural Area",42.13131,-91.38886,"Doug Veal",adult,,Pinned,1,,,,,,,,,
670,,2014-000670,SPM000107,"Virbia rubicundaria","Ruddy Homomelina",Iowa,Linn,2003-07-23,,"Wanatee County Park",42.0094,-91.56623,"Jim Durbin",adult,Blacklight/Fluorescent,Sighting,1,,,,,,,,,
671,"Jim Durbin Drawer 125",2014-000671,SPM001067,"Caenurgina erechtea","Forage Looper Moth",Iowa,Linn,2004-09-04,,"Wickiup Hill Outdoor Learning Area",42.08398,-91.7651,"Jim Durbin",adult,Blacklight/Fluorescent,Pinned,1,,,,,,,,,
681,"Jim Durbin Drawer 121",2014-000681,SPM011045,"Phoberia atomaris","Common Oak Moth",Iowa,Linn,2008-07-01,,"1460 Douglas Ct, Marion",42.040069,-91.590953,"Jim Durbin",adult,Blacklight/Fluorescent,Pinned,1,,,,,,,,,
682,"Jim Durbin Drawer 125",2014-000682,SPM001068,"Caenurgina erechtea","Forage Looper Moth",Iowa,Linn,2004-09-04,,"Wickiup Hill Outdoor Learning Area",42.08398,-91.7651,"Jim Durbin",adult,Blacklight/Fluorescent,Pinned,1,,,,,,,,,
771,"Jim Durbin Drawer 112",2014-000771,SPM011126,"Idia americalis","American Idia Moth",Iowa,Linn,2008-07-17,,"1460 Douglas Ct, Marion",42.040069,-91.590953,"Jim Durbin",adult,Blacklight/Fluorescent,Pinned,1,,,,,,,,,
793,"Jim Durbin Drawer 120",2014-000793,SPM001078,"Plusiodonta compressipalpis","Moonseed Moth",Iowa,Linn,2004-09-03,,"Wanatee County Park",42.0094,-91.56623,"Jim Durbin",adult,Blacklight/Fluorescent,Pinned,1,,,,,,,,,
818,"Jim Durbin Drawer 105",2014-000818,SPM013200,"Estigmene acrea","Salt Marsh Moth",Iowa,Linn,1997-06-28,,"Cedar Rapids",41.9925,-91.6545,"Doug Veal",adult,,Pinned,1,,,,,,,,,
837,"Jim Durbin Drawer 112",2014-000837,SPM001082,"Idia aemula","Common Idia Moth",Iowa,Linn,2004-09-03,,"Wanatee County Park",42.0094,-91.56623,"Jim Durbin",adult,Blacklight/Fluorescent,Pinned,1,,,,,,,,,
859,"Jim Durbin Drawer 134",2014-000859,SPM001084,"Catocala grynea","Woody Underwing",Iowa,Linn,2004-09-03,,"Wanatee County Park",42.0094,-91.56623,"Jim Durbin",adult,Blacklight/Fluorescent,Pinned,1,,,,,,,,,
892,,2014-000892,SPM000109,"Phragmatobia assimilans","Large Ruby Tiger Moth",Iowa,Linn,2003-08-29,,"Behren's Pond Woodland State Preserve",42.118214,-91.754324,"Jim Durbin",adult,Blacklight/Fluorescent,Sighting,1,,,,,,,,,
931,"Jim Durbin Drawer 113",2014-049974,SPM013814,"Zanclognatha jacchusalis","Wavy-lined Zanclognatha Moth",Iowa,Linn,2009-06-03,,Redacted,Redacted,Redacted,"Jim Durbin",adult,Blacklight/Fluorescent,Pinned,1,,,,,,,,,
965,,2014-000965,SPM011301,"Catocala ultronia","Ultronia Underwing",Iowa,Linn,2008-07-13,,"1460 Douglas Ct, Marion",42.040069,-91.590953,"Jim Durbin",adult,Blacklight/Fluorescent,Pinned,1,,,,,,,,,
966,"Jim Durbin Drawer 124",2014-000966,SPM011302,"Zale galbanata","Maple Zale Moth",Iowa,Linn,2008-07-13,,"1460 Douglas Ct, Marion",42.040069,-91.590953,"Jim Durbin",adult,Blacklight/Fluorescent,Pinned,1,,,,,,,,,
975,"Jim Durbin Drawer 113",2014-000975,SPM011310,"Zanclognatha jacchusalis","Wavy-lined Zanclognatha Moth",Iowa,Linn,2008-07-13,,"1460 Douglas Ct, Marion",42.040069,-91.590953,"Jim Durbin",adult,Blacklight/Fluorescent,Pinned,1,,,,,,,,,
976,"Jim Durbin Drawer 111",2014-000976,SPM011311,"Orgyia leucostigma","White-marked Tussock Moth",Iowa,Linn,2008-07-13,,"1460 Douglas Ct, Marion",42.040069,-91.590953,"Jim Durbin",adult,Blacklight/Fluorescent,Pinned,1,,,,,,,,,
989,"Jim Durbin Drawer 115",2014-000989,SPM011323,"Lascoria ambigualis","Ambiguous Moth",Iowa,Linn,2008-07-13,,"1460 Douglas Ct, Marion",42.040069,-91.590953,"Jim Durbin",adult,Blacklight/Fluorescent,Pinned,1,,,,,,,,,
998,"Jim Durbin Drawer 112",2014-000998,SPM011331,"Idia americalis","American Idia Moth",Iowa,Linn,2008-07-13,,"1460 Douglas Ct, Marion",42.040069,-91.590953,"Jim Durbin",adult,Blacklight/Fluorescent,Pinned,1,,,,,,,,,
999,"Jim Durbin Drawer 115",2014-000999,SPM011332,"Renia sobrialis","Sober Renia Moth",Iowa,Linn,2008-07-13,,"1460 Douglas Ct, Marion",42.040069,-91.590953,"Jim Durbin",adult,Blacklight/Fluorescent,Pinned,1,,,,,,,,,
1081,,2014-001081,SPM010437,"Hypoprepia miniata","Scarlet-Winged Lichen Moth",Iowa,Linn,2007-07-12,,"Pleasant Creek State Recreation Area, Linn County",42.11952,-91.81215,"Frank Olsen",adult,,Pinned,1,,,,,,,,,"to verify"
1090,,2014-001090,SPM011126,"Idia americalis","American Idia Moth",Iowa,Linn,2008-07-17,,"1460 Douglas Ct, Marion",42.040069,-91.590953,"Jim Durbin",adult,"Building Light",Photograph,1,,,,,,,,,
1103,,2014-001103,,"Hypoprepia fucosa","Painted Lichen Moth",Iowa,Linn,2014-07-26,,"Pleasant Creek State Recreation Area, Linn County",42.110327,-91.822988,"Jim Durbin",adult,Blacklight/Fluorescent,Photograph,1,,,,,,,,,
1110,,2014-001110,,"Idia aemula","Common Idia Moth",Iowa,Linn,2014-07-26,,"Pleasant Creek State Recreation Area, Linn County",42.110327,-91.822988,"Jim Durbin",adult,Blacklight/Fluorescent,Photograph,1,,,,,,,,,
1129,,2014-001129,,"Catocala ultronia","Ultronia Underwing",Iowa,Linn,2014-07-26,,"Pleasant Creek State Recreation Area, Linn County",42.110327,-91.822988,"Jim Durbin",adult,Blacklight/Fluorescent,Photograph,1,,,,,,,,,
1130,,2014-001130,,"Hypoprepia fucosa","Painted Lichen Moth",Iowa,Linn,2014-07-26,,"Pleasant Creek State Recreation Area, Linn County",42.110327,-91.822988,"Jim Durbin",adult,Blacklight/Fluorescent,Photograph,1,,,,,,,,,
1131,,2014-001131,,"Zanclognatha jacchusalis","Wavy-lined Zanclognatha Moth",Iowa,Linn,2014-07-26,,"Pleasant Creek State Recreation Area, Linn County",42.110327,-91.822988,"Jim Durbin",adult,Blacklight/Fluorescent,Photograph,1,,,,,,,,,
1133,,2014-001133,,"Catocala ultronia","Ultronia Underwing",Iowa,Linn,2014-07-26,,"Pleasant Creek State Recreation Area, Linn County",42.110327,-91.822988,"Jim Durbin",adult,Blacklight/Fluorescent,Photograph,1,,,,,,,,,
1134,"Jim Durbin Drawer 126",2014-001134,,"Catocala judith","Judith's Underwing",Iowa,Linn,2014-07-26,,"Pleasant Creek State Recreation Area, Linn County",42.110327,-91.822988,"Jim Durbin",adult,Blacklight/Fluorescent,Pinned,1,,,,,,,,,*
1137,,2014-001137,,"Tetanolita floridana","Florida Tetanolita Moth",Iowa,Linn,2014-07-26,,"Pleasant Creek State Recreation Area, Linn County",42.110327,-91.822988,"Jim Durbin",adult,Blacklight/Fluorescent,Photograph,1,,,,,,,,,