ID,"Collection / Source","Catalog Number","Specify Number",Taxon,"Common Name",State,County,Date,Time,Locale,Latitude,Longitude,Collector,"Life Stage","Collection Method","Preparation Type",Count,Temperature,Humidity,"Dew Point",Wind,"Wind Direction","Barometric Pressure",Sky,"Moon Phase",Notes
3845,,2014-004126,,"Limenitis arthemis astyanax","Red-spotted Purple",Iowa,Jones,1950-08-01,,"Jones County",42.151672,-91.1353," USGS - NPWRC",adult,Sighting,Sighting,1,,,,,,,,,"HIstorical Record"
3919,,2014-004200,,"Limenitis arthemis astyanax","Red-spotted Purple",Iowa,Jones,1950-08-01,,"Jones County",42.151672,-91.1353," USGS - NPWRC",adult,Sighting,Sighting,1,,,,,,,,,"HIstorical Record"
57573,,2014-057955,,"Limenitis arthemis astyanax","Red-spotted Purple",Iowa,Jones,2007-07-20,,"Breen Prairie",42.282093,-91.196705,"Frank Olsen",adult,Sighting,Sighting,1,,,,,,,,,
116046,,2015-006604,,"Limenitis arthemis astyanax","Red-spotted Purple",Iowa,Jones,1998-07-18,,"Muskrat Slough Wildlife Area",41.995104,-91.210021,"Chris Edwards",adult,Sighting,Sighting,2,,,,,,,,,
116047,,2015-006605,,"Limenitis arthemis astyanax","Red-spotted Purple",Iowa,Jones,1999-08-01,,"Muskrat Slough Wildlife Area",41.995104,-91.210021,"Chris Edwards",adult,Sighting,Sighting,2,,,,,,,,,
116048,,2015-006606,,"Limenitis arthemis astyanax","Red-spotted Purple",Iowa,Jones,2000-08-06,,"Muskrat Slough Wildlife Area",41.995104,-91.210021,"Chris Edwards",adult,Sighting,Sighting,3,,,,,,,,,
116064,,2015-006622,,"Limenitis arthemis astyanax","Red-spotted Purple",Iowa,Jones,1998-05-30,,"Beam's Woods",42.142425,-91.343915,"Chris Edwards",adult,Sighting,Sighting,1,,,,,,,,,
116065,,2015-006623,,"Limenitis arthemis astyanax","Red-spotted Purple",Iowa,Jones,2009-06-09,,"Indian Bluffs Wildlife Management Area",42.218938,-91.070555,"Chris Edwards",adult,Sighting,Sighting,3,,,,,,,,,
168715,,2016-033460,,"Limenitis arthemis astyanax","Red-spotted Purple",Iowa,Jones,2016-06-06,,"Westphal Timber, Jones",42.1349,-90.95348,"Anita Westphal",adult,Sighting,Sighting,12,,,,,,,,,
183801,,2017-001762,,"Limenitis arthemis astyanax","Red-spotted Purple",Iowa,Jones,2016-06-11,,"Beam's Woods",42.142425,-91.343915,"Chris Edwards",adult,Sighting,Sighting,1,,,,,,,,,
208852,,2018-007024,,"Limenitis arthemis astyanax","Red-spotted Purple",Iowa,Jones,2017-06-18,1230,"Westphal Timber, Jones",42.1349,-90.95348,"Anita Westphal",adult,Sighting,Sighting,6,75,,,7,,,"Partly Cloudy",,"Woodland Edge,Field Road,Woodland Edge,Field Road,Woodland Edge"
246893,,,,"Limenitis arthemis astyanax","Red-spotted Purple",Iowa,Jones,2001-06-23,,"Westphal Timber, Jones",42.1349,-90.95348,"Jim Durbin",,Sighting,Sighting,2,,,,,,,,,
257332,,,,"Limenitis arthemis astyanax","Red-spotted Purple",Iowa,Jones,2017-06-18,12:30,"Westphal Timber, Jones",42.1349,-90.95348,IBSN,adult,Sighting,Sighting,6,75,,,"Moderately Windy",,,"Partly Cloudy",,
