ID,"Collection / Source","Catalog Number","Specify Number",Taxon,"Common Name",State,County,Date,Time,Locale,Latitude,Longitude,Collector,"Life Stage","Collection Method","Preparation Type",Count,Temperature,Humidity,"Dew Point",Wind,"Wind Direction","Barometric Pressure",Sky,"Moon Phase",Notes
2599,,2014-002880,,"Colias philodice","Clouded Sulphur",Iowa,Jones,1950-08-01,,"Jones County",42.151672,-91.1353," USGS - NPWRC",adult,Sighting,Sighting,1,,,,,,,,,"HIstorical Record"
53118,,2014-053500,,"Colias philodice","Clouded Sulphur",Iowa,Jones,2007-07-20,,"Breen Prairie",42.282093,-91.196705,"Frank Olsen",adult,Sighting,Sighting,1,,,,,,,,,
53286,,2014-053668,,"Colias philodice","Clouded Sulphur",Iowa,Jones,2012-07-20,,"Hamilton and Tapken Prairie Preserve",42.1775,-90.9975,"Frank Olsen",adult,Sighting,Sighting,1,,,,,,,,,
106885,,2014-107632,,"Colias philodice","Clouded Sulphur",Iowa,Jones,2012-06-22,,"Mallard Marsh",42.119996,-91.162116,"Frank Olsen",adult,Sighting,Sighting,1,,,,,,,,,
113705,,2015-004263,,"Colias philodice","Clouded Sulphur",Iowa,Jones,1998-07-18,,"Muskrat Slough Wildlife Area",41.995104,-91.210021,"Chris Edwards",adult,Sighting,Sighting,5,,,,,,,,,
113706,,2015-004264,,"Colias philodice","Clouded Sulphur",Iowa,Jones,1999-08-01,,"Muskrat Slough Wildlife Area",41.995104,-91.210021,"Chris Edwards",adult,Sighting,Sighting,5,,,,,,,,,
113707,,2015-004265,,"Colias philodice","Clouded Sulphur",Iowa,Jones,2000-08-06,,"Muskrat Slough Wildlife Area",41.995104,-91.210021,"Chris Edwards",adult,Sighting,Sighting,4,,,,,,,,,
113708,,2015-004266,,"Colias philodice","Clouded Sulphur",Iowa,Jones,2001-07-04,,"Muskrat Slough Wildlife Area",41.995104,-91.210021,"Chris Edwards",adult,Sighting,Sighting,12,,,,,,,,,
113709,,2015-004267,,"Colias philodice","Clouded Sulphur",Iowa,Jones,2002-08-18,,"Muskrat Slough Wildlife Area",41.995104,-91.210021,"Chris Edwards",adult,Sighting,Sighting,20,,,,,,,,,
113710,,2015-004268,,"Colias philodice","Clouded Sulphur",Iowa,Jones,2009-06-09,,"Hale Wildlife Area",42.020293,-91.035895,"Chris Edwards",adult,Sighting,Sighting,1,,,,,,,,,
113747,,2015-004305,,"Colias philodice","Clouded Sulphur",Iowa,Jones,2000-04-28,,"Beam's Woods",42.142425,-91.343915,"Chris Edwards",adult,Sighting,Sighting,1,,,,,,,,,
113748,,2015-004306,,"Colias philodice","Clouded Sulphur",Iowa,Jones,2002-08-17,,"Beam's Woods",42.142425,-91.343915,"Chris Edwards",adult,Sighting,Sighting,1,,,,,,,,,
122561,,2015-013118,,"Colias philodice","Clouded Sulphur",Iowa,Jones,2015-05-01,"1000 - 1300","Westphal Timber, Jones",42.13475,-90.9556,"Jim Durbin",adult,Sighting,Sighting,1,67,31,35,3,160,30.06,Cloudy,"Waxing Gibbous",
127776,,2015-018366,,"Colias philodice","Clouded Sulphur",Iowa,Jones,2015-06-17,,"Westphal Timber, Jones",42.1349,-90.95348,"Jeff Westphal",adult,Sighting,Sighting,1,,,,,,,,,
127783,,2015-018373,,"Colias philodice","Clouded Sulphur",Iowa,Jones,2015-06-27,,"Westphal Timber, Jones",42.1349,-90.95348,"Jeff Westphal",adult,Sighting,Sighting,20,,,,,,,,,
168720,,2016-033465,,"Colias philodice","Clouded Sulphur",Iowa,Jones,2016-06-06,,"Westphal Timber, Jones",42.1349,-90.95348,"Anita Westphal",adult,Sighting,Sighting,1,,,,,,,,,
180052,,2016-044802,,"Colias philodice","Clouded Sulphur",Iowa,Jones,2016-11-06,,"Westphal Timber, Jones",42.1349,-90.95348,"Anita Westphal",adult,Sighting,Sighting,5,,,,,,,,,
180056,,2016-044806,,"Colias philodice","Clouded Sulphur",Iowa,Jones,2016-11-06,,"Westphal Timber, Jones",42.1349,-90.95348,"Jeff Westphal",adult,Sighting,Sighting,1,,,,,,,,,
181077,,2016-045827,,"Colias philodice","Clouded Sulphur",Iowa,Jones,2016-09-20,,"Breen Prairie",42.282093,-91.196705,"Frank Olsen",adult,Sighting,Sighting,1,,,,,,,,,
184314,,2017-002275,,"Colias philodice","Clouded Sulphur",Iowa,Jones,2016-09-11,,"Beam's Woods",42.142425,-91.343915,"Chris Edwards",adult,Sighting,Sighting,1,,,,,,,,,
208833,,2018-006979,,"Colias philodice","Clouded Sulphur",Iowa,Jones,2017-04-23,1305,"Westphal Timber, Jones",42.1349,-90.95348,"Anita Westphal",adult,Sighting,Sighting,1,75,,,0,,,Clear,,"Woodland Edge,Field Road,Woodland Edge,Field Road,Woodland Edge"
208834,,2018-006992,,"Colias philodice","Clouded Sulphur",Iowa,Jones,2017-05-13,1305,"Westphal Timber, Jones",42.1349,-90.95348,"Anita Westphal",adult,Sighting,Sighting,4,83,,,7,,,Clear,,"Woodland Edge,Field Road,Woodland Edge,Field Road,Woodland Edge"
208835,,2018-007003,,"Colias philodice","Clouded Sulphur",Iowa,Jones,2017-05-31,1305,"Westphal Timber, Jones",42.1349,-90.95348,"Anita Westphal",adult,Sighting,Sighting,1,73,,,7,,,Overcast,,"Woodland Edge,Field Road,Woodland Edge,Field Road,Woodland Edge"
208836,,2018-007014,,"Colias philodice","Clouded Sulphur",Iowa,Jones,2017-06-18,1230,"Westphal Timber, Jones",42.1349,-90.95348,"Anita Westphal",adult,Sighting,Sighting,2,75,,,7,,,"Partly Cloudy",,"Woodland Edge,Field Road,Woodland Edge,Field Road,Woodland Edge"
208837,,2018-007030,,"Colias philodice","Clouded Sulphur",Iowa,Jones,2017-07-15,1345,"Westphal Timber, Jones",42.1349,-90.95348,"Anita Westphal",adult,Sighting,Sighting,15,80,,,2,,,"Mostly Clear",,"Woodland Edge,Field Road,Woodland Edge,Field Road,Woodland Edge"
240572,,,,"Colias philodice","Clouded Sulphur",Iowa,Jones,2019-07-06,1245-1415,"Hamilton and Tapken Prairie Preserve",42.1775,-90.9975,"Frank Olsen",adult,Sighting,Sighting,1," 79-81",,,0-6,45,," mostly sun",,
241379,,,,"Colias philodice","Clouded Sulphur",Iowa,Jones,2019-05-15,1055-1120,"Breen Prairie",42.282093,-91.196705,"Frank Olsen",adult,Sighting,Sighting,1," 68-69",,,0-2,180,," sunny",,
252856,,,,"Colias philodice","Clouded Sulphur",Iowa,Jones,2017-04-23,13:05,"Westphal Timber, Jones",42.1349,-90.95348,IBSN,adult,Sighting,Sighting,1,75,,,Calm,,,Clear,,
252857,,,,"Colias philodice","Clouded Sulphur",Iowa,Jones,2017-05-13,13:02,"Westphal Timber, Jones",42.1349,-90.95348,IBSN,adult,Sighting,Sighting,4,83,,,"Moderately Windy",,,Clear,,
252858,,,,"Colias philodice","Clouded Sulphur",Iowa,Jones,2017-05-31,13:00,"Westphal Timber, Jones",42.1349,-90.95348,IBSN,adult,Sighting,Sighting,1,73,,,"Moderately Windy",,,Overcast,,
252859,,,,"Colias philodice","Clouded Sulphur",Iowa,Jones,2017-06-18,12:30,"Westphal Timber, Jones",42.1349,-90.95348,IBSN,adult,Sighting,Sighting,2,75,,,"Moderately Windy",,,"Partly Cloudy",,
252860,,,,"Colias philodice","Clouded Sulphur",Iowa,Jones,2017-07-15,13:45,"Westphal Timber, Jones",42.1349,-90.95348,IBSN,adult,Sighting,Sighting,15,80,,,"Relatively Still",,,"Mostly Clear",,
274491,,,,"Colias philodice","Clouded Sulphur",Iowa,Jones,2020-09-02,,"Whitewater Canyon Wildlife Management Area",42.294543,-90.90167,"Frank Olsen",adult,Sighting,Sighting,7,,,,,,,,,"1305-1340, sunny, 80-81, SW 1-8"
296990,,,,"Colias philodice","Clouded Sulphur",Iowa,Jones,2021-09-09,,"Breen Prairie",42.282093,-91.196705,"Frank Olsen",adult,Sighting,Sighting,6,,,,,,,,,
307743,,,,"Colias philodice","Clouded Sulphur",Iowa,Jones,2021-04-30,,"Beam's Woods",42.142425,-91.343915,"Chris Edwards",adult,Sighting,Sighting,1,,,,,,,,,
307939,,,,"Colias philodice","Clouded Sulphur",Iowa,Jones,2021-06-14,,"Muskrat Slough Wildlife Area",41.995104,-91.210021,"Chris Edwards",adult,Sighting,Sighting,1,,,,,,,,,
